{"text_format":"1","workbook":"xlsx","n_sheets":12,"sheets":["Select an authority","CLA total number","CLA Accommodation","CLA Disability","CLA 3placements","DATA CLA","DATA CLA Acc","DATA CLA DIS","DATA CLA 3P","REF EA Name","REF CAS2","REF CAs"],"not_rendered":{"charts":6,"images":0,"macros":1,"external_links":0,"defined_names":8,"comments":0,"pivot_tables":0},"unopened":[],"bounds":{"document_bytes":16777216,"sheet_cells":100000,"rows_first":2000,"rows_last":500,"rows_between":2000,"halvings":0,"cell_chars":16384,"cell_head_chars":4096},"cells_cut":0,"cells_raw":0,"read":"whole","date_system":"1900"}

{"sheet":"Select an authority","index":0,"n_rows":27,"n_cols":5,"rows_kept":27,"cut":false,"hidden":false,"merged":[]}
[1]
["Selecting an Authority and its Standard Comparator Authorities"]
["PLEASE REMEMBER TO 'ENABLE MACROS' - ",null,null,null,"Please select a Local Authority:"]
["THEY MAY HAVE BEEN DISABLED."]
["Last updated: 23/05/2023"]
[]
["Children Looked After publications can be found at:-"]
["Children's Social Work Statistics"]
[]
[]
{"$rows_left_out":18}
{"sheet":"CLA total number","index":1,"n_rows":47,"n_cols":30,"rows_kept":47,"cut":false,"hidden":false,"merged":[[11,0,11,7],[12,0,12,7],[13,0,13,7]]}
[{"$f":"'DATA CLA'!A1","v":"Looked after children on 31 July, 2016 to 2022"}]
[null,"select comparators:"]
[{"$f":"J3","v":5},null,null,null,null,null,null,null,null,{"$f":"VLOOKUP('Select an authority'!$A$1,'REF CAs'!$A$1:$F$32,2,0)","v":5}]
[{"$f":"J4","v":8},null,null,null,null,null,null,null,null,{"$f":"VLOOKUP('Select an authority'!$A$1,'REF CAs'!$A$1:$F$32,3,0)","v":8}]
[{"$f":"J5","v":28},null,null,null,null,null,null,null,null,{"$f":"VLOOKUP('Select an authority'!$A$1,'REF CAs'!$A$1:$F$32,4,0)","v":28}]
[27,null,null,null,null,null,null,null,null,{"$f":"VLOOKUP('Select an authority'!$A$1,'REF CAs'!$A$1:$F$32,5,0)","v":4}]
[31,null,null,null,null,null,null,null,null,{"$f":"VLOOKUP('Select an authority'!$A$1,'REF CAs'!$A$1:$F$32,6,0)","v":25}]
[]
[]
[]
{"$rows_left_out":38}
{"sheet":"CLA Accommodation","index":2,"n_rows":59,"n_cols":32,"rows_kept":59,"cut":false,"hidden":false,"merged":[[11,0,11,5],[12,0,12,5],[13,0,13,5]]}
[{"$f":"'DATA CLA Acc'!A1","v":"Looked after children by accommodation type on 31 July, 2019 to 2022"}]
[null,"select comparators:"]
[31,null,null,null,null,null,null,null,{"$f":"VLOOKUP('Select an authority'!$A$1,'REF CAs'!$A$1:$F$32,2,0)","v":5}]
[15,null,null,null,null,null,null,null,{"$f":"VLOOKUP('Select an authority'!$A$1,'REF CAs'!$A$1:$F$32,3,0)","v":8}]
[{"$f":"I5","v":28},null,null,null,null,null,null,null,{"$f":"VLOOKUP('Select an authority'!$A$1,'REF CAs'!$A$1:$F$32,4,0)","v":28}]
[9,null,null,null,null,null,null,null,{"$f":"VLOOKUP('Select an authority'!$A$1,'REF CAs'!$A$1:$F$32,5,0)","v":4}]
[17,null,null,null,null,null,null,null,{"$f":"VLOOKUP('Select an authority'!$A$1,'REF CAs'!$A$1:$F$32,6,0)","v":25}]
[]
[]
[]
{"$rows_left_out":50}
{"sheet":"CLA Disability","index":3,"n_rows":40,"n_cols":16,"rows_kept":40,"cut":false,"hidden":false,"merged":[[11,0,11,5],[12,0,12,5],[13,0,13,5]]}
[{"$f":"'DATA CLA DIS'!A1","v":"Looked after children by disability status on 31 July, 2019 to 2022"}]
[null,"select comparators:"]
[32,null,null,null,null,null,null,null,{"$f":"VLOOKUP('Select an authority'!$A$1,'REF CAs'!$A$1:$F$32,2,0)","v":5}]
[26,null,null,null,null,null,null,null,{"$f":"VLOOKUP('Select an authority'!$A$1,'REF CAs'!$A$1:$F$32,3,0)","v":8}]
[14,null,null,null,null,null,null,null,{"$f":"VLOOKUP('Select an authority'!$A$1,'REF CAs'!$A$1:$F$32,4,0)","v":28}]
[{"$f":"I6","v":4},null,null,null,null,null,null,null,{"$f":"VLOOKUP('Select an authority'!$A$1,'REF CAs'!$A$1:$F$32,5,0)","v":4}]
[30,null,null,null,null,null,null,null,{"$f":"VLOOKUP('Select an authority'!$A$1,'REF CAs'!$A$1:$F$32,6,0)","v":25}]
[]
[]
[]
{"$rows_left_out":31}
{"sheet":"CLA 3placements","index":4,"n_rows":40,"n_cols":17,"rows_kept":40,"cut":false,"hidden":false,"merged":[[11,0,11,3],[12,0,12,3],[13,0,13,3]]}
[{"$f":"'DATA CLA 3P'!A1","v":"Looked after children with 3 or more placements during the year for those looked on 31 July, 2019 to 2022"}]
[null,"select comparators:"]
[{"$f":"H3","v":5},null,null,null,null,null,null,{"$f":"VLOOKUP('Select an authority'!$A$1,'REF CAs'!$A$1:$F$32,2,0)","v":5}]
[30,null,null,null,null,null,null,{"$f":"VLOOKUP('Select an authority'!$A$1,'REF CAs'!$A$1:$F$32,3,0)","v":8}]
[{"$f":"H5","v":28},null,null,null,null,null,null,{"$f":"VLOOKUP('Select an authority'!$A$1,'REF CAs'!$A$1:$F$32,4,0)","v":28}]
[{"$f":"H6","v":4},null,null,null,null,null,null,{"$f":"VLOOKUP('Select an authority'!$A$1,'REF CAs'!$A$1:$F$32,5,0)","v":4}]
[31,null,null,null,null,null,null,{"$f":"VLOOKUP('Select an authority'!$A$1,'REF CAs'!$A$1:$F$32,6,0)","v":25}]
[]
[]
[]
{"$rows_left_out":31}
{"sheet":"DATA CLA","index":5,"n_rows":41,"n_cols":25,"rows_kept":41,"cut":false,"hidden":true,"merged":[[2,9,2,13]]}
["Looked after children on 31 July, 2016 to 2022"]
[]
["Total number of looked after children on 31 July 2016-2022",null,null,null,null,null,null,null,null,"Population Aged 0-17",null,null,null,null,null,null,null,"Total number of children looked after at 31 July 2016-2022- rate per 1000, 0-17 population"]
[]
["Council",2016,2017,2018,2019,2020,2021,2022,null,2016,2017,2018,2019,2020,2021,2022,null,"Council",2016,2017,2018,2019,2020,2021,2022]
["Aberdeen City",553,590,549,542,566,516,480,null,38001,38221,38418,38966,39401,39663,39663,null,"Aberdeen City",{"$f":"IFERROR(B6*1000/J6,\"*\")","v":14.552248625036183},{"$f":"IFERROR(C6*1000/K6,\"*\")","v":15.436540121922503},{"$f":"IFERROR(D6*1000/L6,\"*\")","v":14.290176479775106},{"$f":"IFERROR(E6*1000/M6,\"*\")","v":13.909562182415439},{"$f":"IFERROR(F6*1000/N6,\"*\")","v":14.365117636608208},{"$f":"IFERROR(G6*1000/O6,\"*\")","v":13.009605929959912},{"$f":"IFERROR(H6*1000/P6,\"*\")","v":12.101959004613873}]
["Aberdeenshire",411,395,409,403,404,386,378,null,54908,54677,54594,54634,54387,54422,54422,null,"Aberdeenshire",7.4852480512857875,7.2242441977431096,7.4916657508151081,7.3763590438188675,7.428245720484675,7.0927198559406124,6.9457204806879567]
["Angus",238,255,251,244,265,252,211,null,22034,21907,21759,21588,21420,21172,21172,null,"Angus",10.801488608514115,11.640115031725019,11.535456592674295,11.302575504910136,12.371615312791784,11.902512752692235,9.9659928207065942]
["Argyll & Bute",163,175,149,150,162,151,144,null,15141,14906,14742,14566,14304,14202,14202,null,"Argyll & Bute",10.765471237038504,11.740238830001342,10.10717677384344,10.297954139777564,11.325503355704697,10.632305309111393,10.139416983523448]
["City of Edinburgh",1368,1349,1309,1234,1180,1045,1015,null,86107,86478,86866,87481,87556,87551,87551,null,"City of Edinburgh",15.887210099062793,15.599343185550081,15.069187023691663,14.105920142659549,13.477088948787062,11.93590021815856,11.593242795627692]
{"$rows_left_out":32}
{"sheet":"DATA CLA Acc","index":6,"n_rows":48,"n_cols":36,"rows_kept":48,"cut":false,"hidden":true,"merged":[[3,33,3,34],[3,24,3,25]]}
["Looked after children by accommodation type on 31 July, 2019 to 2022"]
[]
[null,2019,null,null,null,null,null,null,null,null,2020,null,null,null,null,null,null,null,null,2021,null,null,null,null,null,null,null,null,2022]
[null,"In the community",null,null,null,null,"In residential accommodation",null,null,null,"In the community",null,null,null,null,"In residential accommodation",null,null,null,"In the community",null,null,null,null,"In residential accommodation",null,null,null,"In the community",null,null,null,null,"In residential accommodation"]
[null,"At home with parents","With friends / relatives","With foster carers provided by LA","With foster carers purchased by LA","In other community(1)","In local authority home/ Voluntary Home ","In other residential care(2)","Total",null,"At home with parents","With friends / relatives","With foster carers provided by LA","With foster carers purchased by LA","In other community(1)","In local authority home/ Voluntary Home ","In other residential care(2)","Total",null,"At home with parents","With friends / relatives","With foster carers provided by LA","With foster carers purchased by LA","In other community(1)","In local authority home/ Voluntary Home ","In other residential care(2)","Total",null,"At home with parents","With friends / relatives","With foster carers provided by LA","With foster carers purchased by LA","In other community(1)","In local authority home/ Voluntary Home ","In other residential care(2)","Total"]
["Council"]
["Aberdeen City",97,98,81,193,22,16,35,542,null,120,105,77,185,18,17,44,566,null,95,106,78,164,16,18,39,516,null,86,99,73,146,21,17,38,480]
["Aberdeenshire",68,75,139,36,14,31,40,403,null,71,81,140,34,7,35,36,404,null,61,79,124,42,12,35,33,386,null,68,65,114,43,15,43,30,378]
["Angus",61,65,80,7,6,8,17,244,null,78,57,84,11,8,6,21,265,null,58,66,84,17,4,4,19,252,null,33,49,66,23,3,9,28,211]
["Argyll & Bute",46,42,32,3,2,15,10,150,null,48,51,33,5,1,14,10,162,null,38,55,29,3,0,15,11,151,null,41,47,27,2,1,16,10,144]
{"$rows_left_out":39}
{"sheet":"DATA CLA DIS","index":7,"n_rows":40,"n_cols":13,"rows_kept":40,"cut":false,"hidden":true,"merged":[]}
["Looked after children by disability status on 31 July, 2019 to 2022"]
[]
[null,2019,null,null,2020,null,null,2021,null,null,2022]
["Council","Number of children looked after ","Number of children looked after with a disability","Percentage of children looked after with a disability","Number of children looked after ","Number of children looked after with a disability","Percentage of children looked after with a disability","Number of children looked after ","Number of children looked after with a disability","Percentage of children looked after with a disability","Number of children looked after ","Number of children looked after with a disability","Percentage of children looked after with a disability"]
["Aberdeen City",542,142,0.26199261992619927,549,130,0.22968197879858657,516,129,{"$f":"I5/H5","v":0.25},480,122,{"$f":"L5/K5","v":0.25416666666666665}]
["Aberdeenshire",403,80,0.19851116625310175,409,77,0.1905940594059406,386,71,{"$f":"I6/H6","v":0.18393782383419688},378,65,{"$f":"L6/K6","v":0.17195767195767195}]
["Angus",244,46,0.18852459016393441,251,20,7.5471698113207544E-2,252,31,0.12301587301587301,211,18,8.5308056872037921E-2]
["Argyll & Bute",150,34,0.22666666666666666,149,39,0.24074074074074073,151,45,0.29801324503311261,144,37,0.25694444444444442]
["City of Edinburgh",1234,57,4.6191247974068074E-2,1309,55,4.6610169491525424E-2,1045,52,4.9760765550239235E-2,1015,49,4.8275862068965517E-2]
["Clackmannanshire",185,13,7.0270270270270274E-2,211,14,5.6451612903225805E-2,261,14,5.3639846743295021E-2,263,12,4.5627376425855515E-2]
{"$rows_left_out":31}
{"sheet":"DATA CLA 3P","index":8,"n_rows":42,"n_cols":17,"rows_kept":42,"cut":false,"hidden":true,"merged":[]}
["Looked after children with 3 or more placements during the year for those looked on 31 July, 2019 to 2022"]
[]
[null,null,2019,null,null,null,2020,null,null,null,2021,null,null,null,2022]
[null,null,"Number of children looked after ","Number with 3 or more placements","Percentage with 3 or more placements",null,"Number of children looked after ","Number with 3 or more placements","Percentage with 3 or more placements",null,"Number of children looked after ","Number with 3 or more placements","Percentage with 3 or more placements",null,"Number of children looked after ","Number with 3 or more placements","Percentage with 3 or more placements"]
["Council"]
["Aberdeen City",null,542,29,5.350553505535055E-2,null,566,29,5.1236749116607777E-2,null,516,34,6.589147286821706E-2,null,480,21,4.3749999999999997E-2]
["Aberdeenshire",null,403,29,7.1960297766749379E-2,null,404,15,3.7128712871287127E-2,null,386,19,4.9222797927461141E-2,null,378,13,3.439153439153439E-2]
["Angus",null,244,18,7.3770491803278687E-2,null,265,31,0.1169811320754717,null,252,35,0.1388888888888889,null,211,22,0.10426540284360189]
["Argyll & Bute",null,150,9,0.06,null,162,2,1.2345679012345678E-2,null,151,8,5.2980132450331126E-2,null,144,6,4.1666666666666664E-2]
["City of Edinburgh",null,1234,91,7.3743922204213941E-2,null,1180,67,5.6779661016949153E-2,null,1045,47,4.4976076555023926E-2,null,1015,56,5.5172413793103448E-2]
{"$rows_left_out":33}
{"sheet":"REF EA Name","index":9,"n_rows":35,"n_cols":2,"rows_kept":35,"cut":false,"hidden":true,"merged":[]}
["EA Code","EA Name"]
[]
[100,"Aberdeen City"]
[110,"Aberdeenshire"]
[120,"Angus"]
[130,"Argyll & Bute"]
[230,"City of Edinburgh"]
[150,"Clackmannanshire"]
[170,"Dumfries and Galloway"]
[180,"Dundee City"]
{"$rows_left_out":26}
{"sheet":"REF CAS2","index":10,"n_rows":33,"n_cols":12,"rows_kept":33,"cut":false,"hidden":true,"merged":[]}
[]
[100,"Aberdeen City","City of Edinburgh","****","Dundee City","***","South Ayrshire","***","Argyll and Bute","***","Renfrewshire","***"]
[110,"Aberdeenshire","Stirling","****","Perth and Kinross","****","Highland","****","Scottish Borders","****","South Lanarkshire","****"]
[120,"Angus","Highland","*****","Dumfries and Galloway","*****","Moray","*****","Scottish Borders","****","South Ayrshire","****"]
[130,"Argyll & Bute","South Ayrshire","*****","Dumfries and Galloway","****","Scottish Borders","****","Highland","****","Angus","****"]
[230,"City of Edinburgh","Aberdeen City","****","Dundee City","**","South Ayrshire","**","Argyll and Bute","**","Renfrewshire","**"]
[150,"Clackmannanshire","North Lanarkshire","*****","West Lothian","****","Falkirk","****","South Lanarkshire","****","East Ayrshire","****"]
[170,"Dumfries & Galloway","Angus","*****","Highland","****","Argyll and Bute","****","Scottish Borders","****","Moray","****"]
[180,"Dundee City","Aberdeen City","***","Renfrewshire","***","Dumfries and Galloway","***","Inverclyde","***","South Ayrshire","***"]
[190,"East Ayrshire","North Lanarkshire","*****","Clackmannanshire","****","Falkirk","****","North Ayrshire","****","West Lothian","****"]
{"$rows_left_out":24}
{"sheet":"REF CAs","index":11,"n_rows":70,"n_cols":11,"rows_kept":70,"cut":false,"hidden":true,"merged":[]}
[1,{"$f":"INDEX($J$1:$K$32,MATCH(C39,$J$1:$J$32,0),2)","v":5},8,28,4,25,null,null,"Aberdeen City","Aberdeen City",1]
[2,30,24,16,26,29,null,null,"Aberdeenshire","Aberdeenshire",2]
[3,16,7,19,26,28,null,null,"Angus","Angus",3]
[4,28,7,26,16,3,null,null,"Argyll and Bute","Argyll and Bute",4]
[5,1,8,28,4,25,null,null,"Clackmannanshire","City of Edinburgh",5]
[6,22,32,13,29,9,null,null,"Dumfries and Galloway","Clackmannanshire",6]
[7,3,16,4,26,19,null,null,"Dundee City","Dumfries and Galloway",7]
[8,1,25,7,17,28,null,null,"East Ayrshire","Dundee City",8]
[9,22,6,13,21,32,null,null,"East Dunbartonshire","East Ayrshire",9]
[10,12,30,11,2,24,null,null,"East Lothian","East Dunbartonshire",10]
{"$rows_left_out":60}