{"text_format":"1","workbook":"xlsx","n_sheets":6,"sheets":["Intro","TablesA&B - Client numbers","TableC - Time interval (LA)","TableD - Time interval (EC)","LKPS","Data"],"not_rendered":{"charts":0,"images":0,"macros":1,"external_links":0,"defined_names":4,"comments":0,"pivot_tables":0},"unopened":[],"bounds":{"document_bytes":16777216,"sheet_cells":100000,"rows_first":2000,"rows_last":500,"rows_between":2000,"halvings":0,"cell_chars":16384,"cell_head_chars":4096},"cells_cut":0,"cells_raw":0,"read":"whole","date_system":"1900"}

{"sheet":"Intro","index":0,"n_rows":51,"n_cols":9,"rows_kept":51,"cut":false,"hidden":false,"merged":[[45,8,45,12],[50,3,50,4],[47,1,47,9],[49,1,49,9],[33,3,33,12],[43,3,43,12],[31,1,31,12],[7,1,7,2],[11,2,11,13],[25,3,25,12],[23,1,23,12],[21,1,21,12],[7,3,7,12],[6,3,6,12],[27,3,27,12],[29,3,29,12],[4,1,4,2],[5,1,5,2],[6,1,6,2],[4,3,4,12],[5,3,5,12],[17,2,17,12]]}
[" ","ELIGIBILITY CRITERIA and WAITING TIMES - Data Tables"]
[]
[null,"Data available"]
[]
[null,"Table A",null,"Presents the number of new clients and the rate per 1,000 population for clients recorded as being new to social work services (as defined below) who received a community care assessment in the quarter."]
[null,"Table B",null,"Presents the number of new Personal Care (PC) clients and the rate per 1,000 population for clients recorded as receiving a new service (as defined below) within the quarter."]
[null,"Table C",null,"Presents data on the time intervals recorded for clients by Eligibility Category between first contact and completion of assessment and between completion of assessment and service delivery. "]
[null,"Table D",null,"Presents individual Local Authority data on the time intervals recorded for clients between first contact and completion of assessment and between completion of assessment and service delivery by Eligibility Category."]
[]
[null,"Notes"]
[]
[null,"1 - ","Not all Local Authorities have been able to return data for this collection. Authorities without data have had their figures denoted as \"NR\" (Not Returned) in the data tables."]
[null,"2 - ","Data is collected on the reason for delays of over six weeks for the delivery of service, the main reasons provided include:"]
[null,null,"-","Waiting for a vacancy in a care home of family choice, or for appropriate care at home services"]
[null,null,"-","Admission / re-admission into hospital"]
[null,null,"-","Waiting for financial paperwork or delays caused by legal issues"]
[null,"3 - ","Population data sourced from NRS mid-year estimates up to June 2017, which is the latest available."]
[null,null,"http://www.nrscotland.gov.uk/statistics-and-data/statistics/statistics-by-theme/population/population-estimates/"]
[]
[null,"Information on data requested within the quarterly return"]
[]
[null,"Table 1 counts NEW CLIENTS, by age band, of the numbers of older people in each of the eligibility categories following a completed COMMUNITY CARE ASSESSMENT.  "]
[]
[null,"Table 2 looks at the time interval from FIRST CONTACT to completion of a COMMUNITY CARE ASSESSMENT separately for each of the eligibility categories, for NEW CLIENTS recorded in Table 1. There is no national target for assessment waiting times: CoSLA and the Scottish Government will keep under review information from councils on the actual timescales between first referral and confirmation of need and consider what appropriate standard or standards might be applied in future. The data gathered in Table 2 will provide insight into the variation across Scotland and will inform any future decisions on a possible national standard."]
[]
[null,null,null,"A NEW CLIENT is someone who was not receiving services provided or arranged by local authority adult social care services at the time of the contact or referral that triggered the assessment. This does not mean that the person has never been assessed previously or received services in the past. People who receive information or advice or a basic service as a result of screening but without further assessment are excluded from this definition."]
[]
[null,null,null,"A COMMUNITY CARE ASSESSMENT is defined as a series of actions, undertaken jointly as far as possible with the person being assessed, which includes identifying the extent and nature of their needs, and the key outcomes they would like to achieve, the extent to which these may be enabled or met by community care services or support, informing the person and/or carer of the conclusion, and, where appropriate, devising a care plan and arranging services"]
[]
[null,null,null,"“FIRST CONTACT” is the date on which the potential need for an assessment of social care needs was first notified to the council, by or on behalf of the client. (Note: there is currently no National Minimum Information Standard for this data item). For the sake of clarity, the assessment at issue is the one whose end date was used to select the client, or the one associated with the care plan date used to select the client."]
[]
[null,"Table 3 provides the distribution of time intervals from completion of a community care assessment to DELIVERY OF SERVICE, separately for people in each of the eligibility categories. Information in this table will be used to monitor the new 6 week waiting time target to Personal Care for older people aged 65+ who have been assessed in the critical or substantial needs categories. Table 3 counts clients aged 65+ with a relevant personal care service start date in the reporting period. These clients don't need to be NEW to Social Care services and may already have another service, such as telecare or meals service. Therefore Table 3 does not count the same cohort of people as Tables 1 and 2. "]
[]
[null,null,null,"The relevant personal and nursing care services required for Table 3 are restricted to:"]
[null,null,null,"    - personal care at home, or"]
[null,null,null,"    - personal and nursing care in a care home, or"]
[null,null,null,"    - a Direct Payment / Self Directed Support provided for personal care needs. "]
[]
[null,null,null,"Personal care at home includes intermediate care (e.g. rapid response, crisis care) but, for the purposes of this measure, excludes: "]
[null,null,null,"    - telecare, "]
[null,null,null,"    - equipment and adaptations, and "]
[null,null,null,"    - nursing services provided by the NHS."]
[]
[null,null,null,"“DELIVERY OF SERVICE” means the date by which the services set out in the agreed Care and Support Plan are being delivered to the client.  The Delivery of Service date is therefore the first date after confirmation of need on which either personal care at home, or personal and nursing care in a care home, or a Direct Payment/ Self Directed Support provided for personal care needs, commences.  "]
[]
[null,"Full definitions are available with the quarterly return template",null,null,null,null,null,null,"http://www.scotland.gov.uk/Topics/Statistics/Browse/Health/QuarterlySurvey"]
[]
[null,"Contact"]
[]
[null,"If you have any questions or queries please send an e-mail, to the address below."]
[null,"E-mail:",null,"SWStat@gov.scot"]

{"sheet":"TablesA&B - Client numbers","index":1,"n_rows":83,"n_cols":17,"rows_kept":83,"cut":false,"hidden":false,"merged":[[2,3,2,16],[44,3,44,16],[3,5,3,6],[45,5,45,6],[3,7,3,8],[45,7,45,8],[3,13,3,14],[45,13,45,14],[3,3,3,4],[45,3,45,4],[3,15,3,16],[45,15,45,16],[3,11,3,12],[45,11,45,12],[3,9,3,10],[45,9,45,10]]}
[null,"Table A - NEW Clients receiving a community care assessment in the quarter, January to March 2012 - 2018"]
[]
["2011"]
[null,null,null,"January to March 2012",null,"January to March 2013",null,"January to March 2014",null,"January to March 2015",null,"January to March 2016",null,"January to March 2017",null,"January to March 2018"]
["Totals"," ","Local Authority","Number of new clients","Rate per 1,000 population","Number of new clients","Rate per 1,000 population","Number of new clients","Rate per 1,000 population","Number of new clients","Rate per 1,000 population","Number of new clients","Rate per 1,000 population","Number of new clients","Rate per 1,000 population","Number of new clients","Rate per 1,000 population"]
["JantoMar11"," ","Aberdeen City",136,3.9847641371227662,151,4.478984368047934,49,1.4535746069415605,68,1.9847060883777947,42,1.2200081333875559,56,1.6612281222189262,56,1.5867618723790093]
["AprtoJun11"," ","Aberdeenshire",250,5.5909650005590965,271,6.1063542136097348,199,4.4836987134713739,210,4.5861541821358376,378,8.0923123033118536,322,7.2550300790843334,"NR",""]
["JultoSep11"," ","Angus",183,7.3094743569260263,106,4.2467948717948714,224,8.9686098654708513,77,3.0025346071358938,97,3.7197530390765809,122,4.8846893017296606,59,2.2010818877075176]
["Clients numbers Q1 & Q2"," ","Argyll & Bute",99,4.7703946417385437,265,12.851600387972843,199,9.645678832824391,173,8.1928395529456335,113,5.2991933971112362,125,6.058843487955019,240,10.990520675917022]
[8,null,"Clackmannanshire",89,9.7235878946793406,88,9.7571792881694197,83,9.2007537966965973,87,9.326758147512864,86,8.8907267652227837,111,12.304622547389425,110,10.945273631840797]
["OcttoDec11"," ","Dumfries and Galloway",171,4.8300991441403269,179,5.1099057950328293,186,5.3073103920561548,330,9.2217409529132315,311,8.5578272474615442,227,6.4772013924556298,402,10.746077147210565]
[null,null,"Dundee City",314,12.16064443669881,402,15.800023582124751,342,13.442339438723371,350,13.570099255583127,320,12.375280377446051,406,15.957864947724234,"NR",""]
[null,null,"East Ayrshire",113,4.889446583877807,230,10.089046804404088,293,12.850877192982457,269,11.591330202094197,283,12.036918889030666,375,16.44736842105263,"NR",""]
[0,null,"East Dunbartonshire",237,10.739532354540511,235,10.679876386111616,212,9.641622703292704,248,10.969083108496617,222,9.6471406222840255,215,9.7780607604147711,160,6.7519095244123735]
[null,null,"East Lothian",202,10.530705870086539,206,10.785340314136127,159,8.321993091175548,131,6.7165709598031169,146,7.3238023576624034,164,8.5836909871244629,144,6.9044879171461444]
[null,null,"East Renfrewshire",126,7.2988472455540752,115,6.6612604263206672,145,8.3994670682963566,"NR","","NR","","NR","","NR",""]
[null,null,"Edinburgh, City of",1131,15.659397715472481,1322,18.301124093249904,1158,16.037004210059827,1031,13.973597896505922,920,12.294862885550863,618,8.5586084644360731,958,12.430580785799554]
[null,null,"Eilean Siar","NR","",29,4.6281519310564958,17,2.7113237639553427,35,5.425515423965277,13,1.9814052735863437,9,1.4354066985645932,32,4.7365304914150377]
[null,null,"Falkirk",149,5.4201527828301206,252,9.2667500183864089,"NR","","NR","","NR","",274,10.078716986684322,291,9.8543853708093465]
[null,null,"Fife",990,14.221073044602456,732,10.606236235075924,720,10.432212353478128,734,10.326828650618344,1002,13.847046792515409,1332,19.299592853934538,1294,17.347704847704851]
[null,null,"Glasgow City",1448,17.056363743447786,1157,13.907754444591362,1254,15.072658869911175,1439,17.224044239101811,1501,17.975402081362347,1431,17.200139428104379,1364,16.243509741342351]
[null,null,"Highland",269,5.746758102074387,246,5.2856621043810836,320,6.8743286788399569,264,5.4959925054647654,181,3.6880819936018909,44,0.94522019334049412,28,0.54860009012715771]
[null,null,"Inverclyde",68,4.349772916266871,79,5.1198963058976021,36,2.3341762303053879,70,4.4611560767318847,65,4.0903656157573476,66,4.2793230888932108,71,4.3603758521157028]
[null,null,"Midlothian",174,11.353255904998043,131,8.6525759577278745,132,8.716898897180215,130,8.3322650942186911,173,10.815879962488276,147,9.7074555900416026,107,6.4125614287426584]
[null,null,"Moray",125,6.7360025866249931,84,4.545208592608625,67,3.6239723063608831,53,2.7882996632996631,"NR","",123,6.6529640848117699,107,5.335593896479506]
[null,null,"North Ayrshire",96,3.4158838599487615,38,1.3662675727177938,133,4.7809051367770232,59,2.0703933747412009,51,1.7700343594905079,44,1.5816528272044286,"NR",""]
[null,null,"North Lanarkshire",681,12.427234073614482,659,12.314764636630352,654,12.224756065647314,827,15.095648364485982,"NR","",782,14.617368873602752,721,12.592786656187233]
[null,null,"Orkney Islands","NR","","NR","","NR","","NR","","NR","","NR","","NR",""]
[null,null,"Perth & Kinross",286,8.9993706733794845,241,7.5941389632897431,266,8.3821768450242633,299,9.1954729979087215,353,10.614625932162618,330,10.398941198714313,296,8.5759814573373898]
[null,null,"Renfrewshire",231,7.3263558515699332,172,5.535352235059376,289,9.3000804505229286,278,8.7531486146095716,288,8.9669344292919853,283,9.1069991954947707,243,7.3752579822750999]
[null,null,"Scottish Borders",322,12.485943619372602,326,12.683837833631623,272,10.578306693112433,256,9.7227497151538174,"NR","",191,7.4281491852370394,262,9.4588252283475924]
[null,null,"Shetland Islands",51,12.363636363636363,57,13.892273945893249,42,10.226442658875092,52,12.272834552749588,65,15.021955165241506,71,17.287557828098368,81,18.072289156626507]
[null,null,"South Ayrshire",193,7.4655732631904694,147,5.6923791821561336,129,4.9947729120687647,"NR","","NR","","NR","","NR",""]
[null,null,"South Lanarkshire","NR","","NR","","NR","","NR","","NR","","NR","","NR",""]
[null,null,"Stirling",200,11.921793037672867,163,9.8299360752623315,258,15.554349792005787,289,17.106665088196991,295,17.208189931750567,248,14.951468017121844,263,14.827761177200202]
[null,null,"West Dunbartonshire",395,24.906992874708369,162,10.440835266821345,403,25.974863035771833,358,22.737376945061925,349,21.957971561595571,442,28.488559458588462,273,16.718721293404371]
[null,null,"West Lothian",167,6.2807928090563765,109,4.156022419643878,135,5.1459937485705574,69,2.5416236923530282,136,4.8799741648426567,188,7.1662727757871467,162,5.544527346156479]
[null,null,"SCOTLAND",8896,10.013642687654494,8354,9.4298198581576287,8376,9.7534732775093715,8186,10.035786048712671,7390,10.292737143828118,8746,10.37648881733417,7326,7.235076789980317]
[null,null,"Source: Scottish Government Quarterly Monitoring Return"]
[null,null,"Note Scotland population rate is based on populations from LA's returning data (NRS mid-year population estimates up to 2017)"]
[null,null,"NR - No figures returned for quarter"]
[]
[null,"Table B - New personal care clients receiving a new service in the quarter, January to March 2012 - 2018"]
[]
[]
[null,null,null,"January to March 2012",null,"January to March 2013",null,"January to March 2014",null,"January to March 2015",null,"January to March 2016",null,"January to March 2017",null,"January to March 2018"]
[null," ","Local Authority","Number of new clients","Rate per 1,000 population","Number of new clients","Rate per 1,000 population","Number of new clients","Rate per 1,000 population","Number of new clients","Rate per 1,000 population","Number of new clients","Rate per 1,000 population","Number of new clients","Rate per 1,000 population","Number of new clients","Rate per 1,000 population"]
[null," ","Aberdeen City",71,2.0802812774685027,40,1.186485925310711,20,0.59329575793533085,18,0.52536337633529862,8,0.23238250159762969,12,0.35597745476119846,22,0.62337073557746803]
[null," ","Aberdeenshire","NR","","NR","","NR","","NR","",126,2.6974374344372847,89,2.0052722889394587,"NR",""]
[null," ","Angus",234,9.3465409809873794,228,9.134615384615385,185,7.4071108263933372,152,5.9270813023981281,97,3.7197530390765809,86,3.4433055733504165,87,3.2456631225517629]
[null," ","Argyll & Bute",109,5.2522526863585988,89,4.316197866149369,104,5.0409577819785758,110,5.2093199469596518,85,3.9861189270305757,133,6.4466094711841402,147,6.7316939139991749]
[null,null,"Clackmannanshire",96,10.488364470665356,129,14.303137820157446,89,9.8658685289879173,87,9.326758147512864,92,9.5110100279127465,108,11.972065181243766,92,9.154228855721394]
[null," ","Dumfries and Galloway",162,4.5758833997118886,109,3.1116186126177561,154,4.3942247332077837,165,4.6108704764566157,209,5.751080047329463,331,9.4447297837128357,381,10.184714908177178]
[null,null,"Dundee City","NR","",125,4.9129426561333176,52,2.0438644760632028,58,2.248759305210918,71,2.745765333745843,105,4.1270340382045436,"NR",""]
[null,null,"East Ayrshire",138,5.9711825537622776,156,6.843005658639294,222,9.7368421052631575,261,11.246606627310726,318,13.525583769299477,300,13.157894736842104,"NR",""]
[null,null,"East Dunbartonshire",266,12.053652347290194,241,10.952554081076167,171,7.7769692559577948,227,10.040249458180371,224,9.7340517990613584,200,9.095870474804439,131,5.528125923112631]
[null,null,"East Lothian",139,7.2463768115942031,117,6.1256544502617807,89,4.6582225478907144,103,5.2809680065627562,97,4.8658138951592678,95,4.9722600230294152,101,4.8427311085538935]
[null,null,"East Renfrewshire",126,7.2988472455540752,115,6.6612604263206672,145,8.3994670682963566,"NR","","NR","","NR","","NR",""]
[null,null,"Edinburgh, City of",525,7.2689511941848393,545,7.5447145467633865,485,6.7167072900509641,561,7.6034805237049685,625,8.3524883733361843,619,8.5724573454464874,571,7.4090413660663303]
[null,null,"Eilean Siar","NR","",29,4.6281519310564958,17,2.7113237639553427,30,4.6504417919702377,12,1.828989483310471,9,1.4354066985645932,30,4.4404973357015987]
[null,null,"Falkirk",252,9.1669698072026193,263,9.6712510112524814,"NR","","NR","","NR","",261,9.6005296843963794,194,6.5695902472062313]
[null,null,"Fife",230,3.3038856568268331,404,5.8537150805610292,347,5.0277467870234869,384,5.4025915556368451,415,5.7350543102733473,455,6.5925786400452058,496,6.649506649506649]
[null,null,"Glasgow City",494,5.8189528240768,690,8.2941664362731551,695,8.3536665985552361,762,9.1207239125751087,701,8.3949079673784173,796,9.5676526797841266,940,11.194207593007192]
[null,null,"Highland","NR","","NR","","NR","","NR","","NR","","NR","","NR",""]
[null,null,"Inverclyde",70,4.4777074138041328,111,7.1937783538561249,58,3.7606172599364585,68,4.3336944745395449,118,7.4255868101441065,117,7.5860727484925112,103,6.3256156727875705]
[null,null,"Midlothian","NR","","NR","","NR","","NR","","NR","",99,6.5376741728851613,43,2.5770106676255544]
[null,null,"Moray",103,5.550466131378994,82,4.4369893404036578,92,4.9762007788835998,130,6.8392255892255891,"NR","",139,7.5183903072263094,131,6.5323626209235073]
[null,null,"North Ayrshire",33,1.1742100768573867,57,2.0494013590766911,"NR","","NR","","NR","","NR","","NR",""]
[null,null,"North Lanarkshire",383,6.9891786346466178,410,7.6616896828807954,401,7.4956073124228944,502,9.1632593457943923,"NR","",498,9.308759205951624,560,9.7808051698541618]
[null,null,"Orkney Islands","NR","","NR","","NR","","NR","","NR","","NR","","NR",""]
[null,null,"Perth & Kinross",19,0.59786028949024539,41,1.2919489522609107,508,16.00806705741476,487,14.977241973182434,638,19.184508058696174,804,25.335602193231235,1048,30.363610024626972]
[null,null,"Renfrewshire",131,4.1547732318426895,140,4.5055192610948414,312,10.040225261464199,365,11.492443324937028,309,9.6207733980945278,327,10.522928399034594,374,11.351220104406943]
[null,null,"Scottish Borders",82,3.1796502384737679,80,3.1125982413819937,52,2.0223233383891417,43,1.6331181162172426,"NR","",87,3.3835025084587564,143,5.1626412505866641]
[null,null,"Shetland Islands",30,7.2727272727272725,21,5.1182061905922493,32,7.7915753591429269,37,8.7325938163795147,27,6.2398890686387798,24,5.8436815193571947,29,6.4703257474341811]
[null,null,"South Ayrshire",106,4.1002630357419152,106,4.1047087980173478,121,4.6850195531807799,"NR","","NR","","NR","","NR",""]
[null,null,"South Lanarkshire","NR","","NR","","NR","","NR","","NR","","NR","","NR",""]
[null,null,"Stirling",137,8.1664282308059128,69,4.1611385840067543,95,5.7273768613974791,93,5.5049129868592397,80,4.6666277781018488,90,5.4259359739555073,106,5.9762079269324015]
[null,null,"West Dunbartonshire",179,11.286966391323539,140,9.0229440577468409,117,7.5410892684498876,"NR","","NR","",207,13.341927167257493,214,13.105517790434195]
[null,null,"West Lothian",162,6.0927451201624727,63,2.4021047012620582,49,1.867805138370054,67,2.4679534404007661,188,6.7458466396354373,163,6.2133109704963028,122,4.1755082483400647]
[null,null,"SCOTLAND",4277,5.6595259865796326,4600,5.8985551104568561,4612,6.3624675116847573,4710,7.0691955675693521,4440,7.2435986328523301,6154,8.0078282571978061,{"$f":"SUM(P48:P79)","v":6065},5.9897270995400795]
[null,null,"Source: Scottish Government Quarterly Monitoring Return"]
[null,null,"Note Scotland population rate is based on populations from LA's returning data (NRS mid-year population estimates up to 2017)"]
[null,null,"NR - No figures returned for quarter"]

{"sheet":"TableC - Time interval (LA)","index":2,"n_rows":46,"n_cols":17,"rows_kept":46,"cut":false,"hidden":false,"merged":[[0,1,0,14],[8,3,8,8],[8,10,8,15]]}
[null,{"$f":"\"Table C - Time intervals recorded for clients \" &A12& \" between first contact and completion of assessment and between completion of assessment and service delivery. Quarter - \"&A9","v":"Table C - Time intervals recorded for clients in ALL Eligibility Categories between first contact and completion of assessment and between completion of assessment and service delivery. Quarter - January to March 2018"}]
[]
["Year"]
[2011,null,"Select Quarter",null,null,"Select Eligibility Category"]
[null,null,null,null,null,null,null,null,null,null,null,null,{"$f":"OFFSET(LKPS!B2,A6,0)","v":"January to March 2018"}]
[7]
[{"$f":"OFFSET(LKPS!D2,A6,0)","v":"JantoMar18"}," "]
[{"$f":"OFFSET(LKPS!B3,A6,0)","v":0}," ",null,5,6,7,8,9,10,null,11,12,13,14,15,16]
[{"$f":"OFFSET(LKPS!B2,A6,0)","v":"January to March 2018"},null,null,"Time interval between first contact and completion of assessment",null,null,null,null,null,null,"Time interval between completion of assessment and service delivery"]
[6,null,"Local Authority","Less than or equal to 2 days","More than 2 days and <= 2 weeks","More than 2 weeks and <= 4 weeks","More than 4 weeks and <= 6 weeks","More than 6 weeks","Total",null,"Before care assessment completed","Less than or equal to 2 weeks","More than 2 weeks and <= 4 weeks","More than 4 weeks and <= 6 weeks","More than 6 weeks ","Total"]
[{"$f":"OFFSET(LKPS!F2,A10,0)","v":"Totals"}," ","Aberdeen City",{"$f":"IF($J11=\"NR\",\"NR\",(VLOOKUP($A$7&$C11&$A$11,Data!$A:$P,D$8,FALSE)))","v":0.43},{"$f":"IF($J11=\"NR\",\"NR\",(VLOOKUP($A$7&$C11&$A$11,Data!$A:$P,E$8,FALSE)))","v":0.23},{"$f":"IF($J11=\"NR\",\"NR\",(VLOOKUP($A$7&$C11&$A$11,Data!$A:$P,F$8,FALSE)))","v":0.14000000000000001},{"$f":"IF($J11=\"NR\",\"NR\",(VLOOKUP($A$7&$C11&$A$11,Data!$A:$P,G$8,FALSE)))","v":0.16},{"$f":"IF($J11=\"NR\",\"NR\",(VLOOKUP($A$7&$C11&$A$11,Data!$A:$P,H$8,FALSE)))","v":0.04},{"$f":"IF($J11=\"NR\",\"NR\",(VLOOKUP($A$7&$C11&$A$11,Data!$A:$P,I$8,FALSE)))","v":1},{"$f":"IF(VLOOKUP($A$7&$C11&\"Totals\",Data!$A:$P,I$8,FALSE)=0,\"NR\",(VLOOKUP($A$7&$C11&\"Totals\",Data!$A:$P,I$8,FALSE)))","v":1},{"$f":"IF($Q11=\"NR\",\"NR\",(VLOOKUP($A$7&$C11&$A$11,Data!$A:$P,K$8,FALSE)))","v":0.5},{"$f":"IF($Q11=\"NR\",\"NR\",(VLOOKUP($A$7&$C11&$A$11,Data!$A:$P,L$8,FALSE)))","v":0.41},{"$f":"IF($Q11=\"NR\",\"NR\",(VLOOKUP($A$7&$C11&$A$11,Data!$A:$P,M$8,FALSE)))","v":0.09},{"$f":"IF($Q11=\"NR\",\"NR\",(VLOOKUP($A$7&$C11&$A$11,Data!$A:$P,N$8,FALSE)))","v":0},{"$f":"IF($Q11=\"NR\",\"NR\",(VLOOKUP($A$7&$C11&$A$11,Data!$A:$P,O$8,FALSE)))","v":0},{"$f":"IF($Q11=\"NR\",\"NR\",(VLOOKUP($A$7&$C11&$A$11,Data!$A:$P,P$8,FALSE)))","v":1},{"$f":"IF(VLOOKUP($A$7&$C11&\"Totals\",Data!$A:$P,P$8,FALSE)=0,\"NR\",(VLOOKUP($A$7&$C11&\"Totals\",Data!$A:$P,P$8,FALSE)))","v":1}]
[{"$f":"IF(A10=6,\"in ALL Eligibility Categories\",(\"in the \"&A11&\" Eligibility Category\"))","v":"in ALL Eligibility Categories"}," ","Aberdeenshire",{"$f":"IF($J12=\"NR\",\"NR\",(VLOOKUP($A$7&$C12&$A$11,Data!$A:$P,D$8,FALSE)))","v":"NR"},{"$f":"IF($J12=\"NR\",\"NR\",(VLOOKUP($A$7&$C12&$A$11,Data!$A:$P,E$8,FALSE)))","v":"NR"},{"$f":"IF($J12=\"NR\",\"NR\",(VLOOKUP($A$7&$C12&$A$11,Data!$A:$P,F$8,FALSE)))","v":"NR"},{"$f":"IF($J12=\"NR\",\"NR\",(VLOOKUP($A$7&$C12&$A$11,Data!$A:$P,G$8,FALSE)))","v":"NR"},{"$f":"IF($J12=\"NR\",\"NR\",(VLOOKUP($A$7&$C12&$A$11,Data!$A:$P,H$8,FALSE)))","v":"NR"},{"$f":"IF($J12=\"NR\",\"NR\",(VLOOKUP($A$7&$C12&$A$11,Data!$A:$P,I$8,FALSE)))","v":"NR"},{"$f":"IF(VLOOKUP($A$7&$C12&\"Totals\",Data!$A:$P,I$8,FALSE)=0,\"NR\",(VLOOKUP($A$7&$C12&\"Totals\",Data!$A:$P,I$8,FALSE)))","v":"NR"},{"$f":"IF($Q12=\"NR\",\"NR\",(VLOOKUP($A$7&$C12&$A$11,Data!$A:$P,K$8,FALSE)))","v":"NR"},{"$f":"IF($Q12=\"NR\",\"NR\",(VLOOKUP($A$7&$C12&$A$11,Data!$A:$P,L$8,FALSE)))","v":"NR"},{"$f":"IF($Q12=\"NR\",\"NR\",(VLOOKUP($A$7&$C12&$A$11,Data!$A:$P,M$8,FALSE)))","v":"NR"},{"$f":"IF($Q12=\"NR\",\"NR\",(VLOOKUP($A$7&$C12&$A$11,Data!$A:$P,N$8,FALSE)))","v":"NR"},{"$f":"IF($Q12=\"NR\",\"NR\",(VLOOKUP($A$7&$C12&$A$11,Data!$A:$P,O$8,FALSE)))","v":"NR"},{"$f":"IF($Q12=\"NR\",\"NR\",(VLOOKUP($A$7&$C12&$A$11,Data!$A:$P,P$8,FALSE)))","v":"NR"},{"$f":"IF(VLOOKUP($A$7&$C12&\"Totals\",Data!$A:$P,P$8,FALSE)=0,\"NR\",(VLOOKUP($A$7&$C12&\"Totals\",Data!$A:$P,P$8,FALSE)))","v":"NR"}]
[null,null,"Angus",{"$f":"IF($J13=\"NR\",\"NR\",(VLOOKUP($A$7&$C13&$A$11,Data!$A:$P,D$8,FALSE)))","v":0.35},{"$f":"IF($J13=\"NR\",\"NR\",(VLOOKUP($A$7&$C13&$A$11,Data!$A:$P,E$8,FALSE)))","v":0.26},{"$f":"IF($J13=\"NR\",\"NR\",(VLOOKUP($A$7&$C13&$A$11,Data!$A:$P,F$8,FALSE)))","v":0.12},{"$f":"IF($J13=\"NR\",\"NR\",(VLOOKUP($A$7&$C13&$A$11,Data!$A:$P,G$8,FALSE)))","v":0.03},{"$f":"IF($J13=\"NR\",\"NR\",(VLOOKUP($A$7&$C13&$A$11,Data!$A:$P,H$8,FALSE)))","v":0.26},{"$f":"IF($J13=\"NR\",\"NR\",(VLOOKUP($A$7&$C13&$A$11,Data!$A:$P,I$8,FALSE)))","v":1},{"$f":"IF(VLOOKUP($A$7&$C13&\"Totals\",Data!$A:$P,I$8,FALSE)=0,\"NR\",(VLOOKUP($A$7&$C13&\"Totals\",Data!$A:$P,I$8,FALSE)))","v":1},{"$f":"IF($Q13=\"NR\",\"NR\",(VLOOKUP($A$7&$C13&$A$11,Data!$A:$P,K$8,FALSE)))","v":0.67},{"$f":"IF($Q13=\"NR\",\"NR\",(VLOOKUP($A$7&$C13&$A$11,Data!$A:$P,L$8,FALSE)))","v":0.3},{"$f":"IF($Q13=\"NR\",\"NR\",(VLOOKUP($A$7&$C13&$A$11,Data!$A:$P,M$8,FALSE)))","v":0.01},{"$f":"IF($Q13=\"NR\",\"NR\",(VLOOKUP($A$7&$C13&$A$11,Data!$A:$P,N$8,FALSE)))","v":0.02},{"$f":"IF($Q13=\"NR\",\"NR\",(VLOOKUP($A$7&$C13&$A$11,Data!$A:$P,O$8,FALSE)))","v":0},{"$f":"IF($Q13=\"NR\",\"NR\",(VLOOKUP($A$7&$C13&$A$11,Data!$A:$P,P$8,FALSE)))","v":1},{"$f":"IF(VLOOKUP($A$7&$C13&\"Totals\",Data!$A:$P,P$8,FALSE)=0,\"NR\",(VLOOKUP($A$7&$C13&\"Totals\",Data!$A:$P,P$8,FALSE)))","v":1}]
[null,null,"Argyll & Bute",{"$f":"IF($J14=\"NR\",\"NR\",(VLOOKUP($A$7&$C14&$A$11,Data!$A:$P,D$8,FALSE)))","v":0.3},{"$f":"IF($J14=\"NR\",\"NR\",(VLOOKUP($A$7&$C14&$A$11,Data!$A:$P,E$8,FALSE)))","v":0.32},{"$f":"IF($J14=\"NR\",\"NR\",(VLOOKUP($A$7&$C14&$A$11,Data!$A:$P,F$8,FALSE)))","v":0.1},{"$f":"IF($J14=\"NR\",\"NR\",(VLOOKUP($A$7&$C14&$A$11,Data!$A:$P,G$8,FALSE)))","v":0.1},{"$f":"IF($J14=\"NR\",\"NR\",(VLOOKUP($A$7&$C14&$A$11,Data!$A:$P,H$8,FALSE)))","v":0.19},{"$f":"IF($J14=\"NR\",\"NR\",(VLOOKUP($A$7&$C14&$A$11,Data!$A:$P,I$8,FALSE)))","v":1},{"$f":"IF(VLOOKUP($A$7&$C14&\"Totals\",Data!$A:$P,I$8,FALSE)=0,\"NR\",(VLOOKUP($A$7&$C14&\"Totals\",Data!$A:$P,I$8,FALSE)))","v":1},{"$f":"IF($Q14=\"NR\",\"NR\",(VLOOKUP($A$7&$C14&$A$11,Data!$A:$P,K$8,FALSE)))","v":0.56999999999999995},{"$f":"IF($Q14=\"NR\",\"NR\",(VLOOKUP($A$7&$C14&$A$11,Data!$A:$P,L$8,FALSE)))","v":0.12},{"$f":"IF($Q14=\"NR\",\"NR\",(VLOOKUP($A$7&$C14&$A$11,Data!$A:$P,M$8,FALSE)))","v":0.03},{"$f":"IF($Q14=\"NR\",\"NR\",(VLOOKUP($A$7&$C14&$A$11,Data!$A:$P,N$8,FALSE)))","v":0.03},{"$f":"IF($Q14=\"NR\",\"NR\",(VLOOKUP($A$7&$C14&$A$11,Data!$A:$P,O$8,FALSE)))","v":0.25},{"$f":"IF($Q14=\"NR\",\"NR\",(VLOOKUP($A$7&$C14&$A$11,Data!$A:$P,P$8,FALSE)))","v":1},{"$f":"IF(VLOOKUP($A$7&$C14&\"Totals\",Data!$A:$P,P$8,FALSE)=0,\"NR\",(VLOOKUP($A$7&$C14&\"Totals\",Data!$A:$P,P$8,FALSE)))","v":1}]
[null,null,"Clackmannanshire",{"$f":"IF($J15=\"NR\",\"NR\",(VLOOKUP($A$7&$C15&$A$11,Data!$A:$P,D$8,FALSE)))","v":0.36},{"$f":"IF($J15=\"NR\",\"NR\",(VLOOKUP($A$7&$C15&$A$11,Data!$A:$P,E$8,FALSE)))","v":0.25},{"$f":"IF($J15=\"NR\",\"NR\",(VLOOKUP($A$7&$C15&$A$11,Data!$A:$P,F$8,FALSE)))","v":0.04},{"$f":"IF($J15=\"NR\",\"NR\",(VLOOKUP($A$7&$C15&$A$11,Data!$A:$P,G$8,FALSE)))","v":0.05},{"$f":"IF($J15=\"NR\",\"NR\",(VLOOKUP($A$7&$C15&$A$11,Data!$A:$P,H$8,FALSE)))","v":0.31},{"$f":"IF($J15=\"NR\",\"NR\",(VLOOKUP($A$7&$C15&$A$11,Data!$A:$P,I$8,FALSE)))","v":1},{"$f":"IF(VLOOKUP($A$7&$C15&\"Totals\",Data!$A:$P,I$8,FALSE)=0,\"NR\",(VLOOKUP($A$7&$C15&\"Totals\",Data!$A:$P,I$8,FALSE)))","v":1},{"$f":"IF($Q15=\"NR\",\"NR\",(VLOOKUP($A$7&$C15&$A$11,Data!$A:$P,K$8,FALSE)))","v":0.1},{"$f":"IF($Q15=\"NR\",\"NR\",(VLOOKUP($A$7&$C15&$A$11,Data!$A:$P,L$8,FALSE)))","v":0.71},{"$f":"IF($Q15=\"NR\",\"NR\",(VLOOKUP($A$7&$C15&$A$11,Data!$A:$P,M$8,FALSE)))","v":0.16},{"$f":"IF($Q15=\"NR\",\"NR\",(VLOOKUP($A$7&$C15&$A$11,Data!$A:$P,N$8,FALSE)))","v":0.01},{"$f":"IF($Q15=\"NR\",\"NR\",(VLOOKUP($A$7&$C15&$A$11,Data!$A:$P,O$8,FALSE)))","v":0.02},{"$f":"IF($Q15=\"NR\",\"NR\",(VLOOKUP($A$7&$C15&$A$11,Data!$A:$P,P$8,FALSE)))","v":1},{"$f":"IF(VLOOKUP($A$7&$C15&\"Totals\",Data!$A:$P,P$8,FALSE)=0,\"NR\",(VLOOKUP($A$7&$C15&\"Totals\",Data!$A:$P,P$8,FALSE)))","v":1}]
[null,null,"Dumfries and Galloway",{"$f":"IF($J16=\"NR\",\"NR\",(VLOOKUP($A$7&$C16&$A$11,Data!$A:$P,D$8,FALSE)))","v":0.31},{"$f":"IF($J16=\"NR\",\"NR\",(VLOOKUP($A$7&$C16&$A$11,Data!$A:$P,E$8,FALSE)))","v":0.2},{"$f":"IF($J16=\"NR\",\"NR\",(VLOOKUP($A$7&$C16&$A$11,Data!$A:$P,F$8,FALSE)))","v":0.2},{"$f":"IF($J16=\"NR\",\"NR\",(VLOOKUP($A$7&$C16&$A$11,Data!$A:$P,G$8,FALSE)))","v":0.11},{"$f":"IF($J16=\"NR\",\"NR\",(VLOOKUP($A$7&$C16&$A$11,Data!$A:$P,H$8,FALSE)))","v":0.17},{"$f":"IF($J16=\"NR\",\"NR\",(VLOOKUP($A$7&$C16&$A$11,Data!$A:$P,I$8,FALSE)))","v":1},{"$f":"IF(VLOOKUP($A$7&$C16&\"Totals\",Data!$A:$P,I$8,FALSE)=0,\"NR\",(VLOOKUP($A$7&$C16&\"Totals\",Data!$A:$P,I$8,FALSE)))","v":1},{"$f":"IF($Q16=\"NR\",\"NR\",(VLOOKUP($A$7&$C16&$A$11,Data!$A:$P,K$8,FALSE)))","v":0.21},{"$f":"IF($Q16=\"NR\",\"NR\",(VLOOKUP($A$7&$C16&$A$11,Data!$A:$P,L$8,FALSE)))","v":0.34},{"$f":"IF($Q16=\"NR\",\"NR\",(VLOOKUP($A$7&$C16&$A$11,Data!$A:$P,M$8,FALSE)))","v":0.09},{"$f":"IF($Q16=\"NR\",\"NR\",(VLOOKUP($A$7&$C16&$A$11,Data!$A:$P,N$8,FALSE)))","v":0.04},{"$f":"IF($Q16=\"NR\",\"NR\",(VLOOKUP($A$7&$C16&$A$11,Data!$A:$P,O$8,FALSE)))","v":0.31},{"$f":"IF($Q16=\"NR\",\"NR\",(VLOOKUP($A$7&$C16&$A$11,Data!$A:$P,P$8,FALSE)))","v":1},{"$f":"IF(VLOOKUP($A$7&$C16&\"Totals\",Data!$A:$P,P$8,FALSE)=0,\"NR\",(VLOOKUP($A$7&$C16&\"Totals\",Data!$A:$P,P$8,FALSE)))","v":1}]
[null,null,"Dundee City",{"$f":"IF($J17=\"NR\",\"NR\",(VLOOKUP($A$7&$C17&$A$11,Data!$A:$P,D$8,FALSE)))","v":"NR"},{"$f":"IF($J17=\"NR\",\"NR\",(VLOOKUP($A$7&$C17&$A$11,Data!$A:$P,E$8,FALSE)))","v":"NR"},{"$f":"IF($J17=\"NR\",\"NR\",(VLOOKUP($A$7&$C17&$A$11,Data!$A:$P,F$8,FALSE)))","v":"NR"},{"$f":"IF($J17=\"NR\",\"NR\",(VLOOKUP($A$7&$C17&$A$11,Data!$A:$P,G$8,FALSE)))","v":"NR"},{"$f":"IF($J17=\"NR\",\"NR\",(VLOOKUP($A$7&$C17&$A$11,Data!$A:$P,H$8,FALSE)))","v":"NR"},{"$f":"IF($J17=\"NR\",\"NR\",(VLOOKUP($A$7&$C17&$A$11,Data!$A:$P,I$8,FALSE)))","v":"NR"},{"$f":"IF(VLOOKUP($A$7&$C17&\"Totals\",Data!$A:$P,I$8,FALSE)=0,\"NR\",(VLOOKUP($A$7&$C17&\"Totals\",Data!$A:$P,I$8,FALSE)))","v":"NR"},{"$f":"IF($Q17=\"NR\",\"NR\",(VLOOKUP($A$7&$C17&$A$11,Data!$A:$P,K$8,FALSE)))","v":"NR"},{"$f":"IF($Q17=\"NR\",\"NR\",(VLOOKUP($A$7&$C17&$A$11,Data!$A:$P,L$8,FALSE)))","v":"NR"},{"$f":"IF($Q17=\"NR\",\"NR\",(VLOOKUP($A$7&$C17&$A$11,Data!$A:$P,M$8,FALSE)))","v":"NR"},{"$f":"IF($Q17=\"NR\",\"NR\",(VLOOKUP($A$7&$C17&$A$11,Data!$A:$P,N$8,FALSE)))","v":"NR"},{"$f":"IF($Q17=\"NR\",\"NR\",(VLOOKUP($A$7&$C17&$A$11,Data!$A:$P,O$8,FALSE)))","v":"NR"},{"$f":"IF($Q17=\"NR\",\"NR\",(VLOOKUP($A$7&$C17&$A$11,Data!$A:$P,P$8,FALSE)))","v":"NR"},{"$f":"IF(VLOOKUP($A$7&$C17&\"Totals\",Data!$A:$P,P$8,FALSE)=0,\"NR\",(VLOOKUP($A$7&$C17&\"Totals\",Data!$A:$P,P$8,FALSE)))","v":"NR"}]
[null,null,"East Ayrshire",{"$f":"IF($J18=\"NR\",\"NR\",(VLOOKUP($A$7&$C18&$A$11,Data!$A:$P,D$8,FALSE)))","v":"NR"},{"$f":"IF($J18=\"NR\",\"NR\",(VLOOKUP($A$7&$C18&$A$11,Data!$A:$P,E$8,FALSE)))","v":"NR"},{"$f":"IF($J18=\"NR\",\"NR\",(VLOOKUP($A$7&$C18&$A$11,Data!$A:$P,F$8,FALSE)))","v":"NR"},{"$f":"IF($J18=\"NR\",\"NR\",(VLOOKUP($A$7&$C18&$A$11,Data!$A:$P,G$8,FALSE)))","v":"NR"},{"$f":"IF($J18=\"NR\",\"NR\",(VLOOKUP($A$7&$C18&$A$11,Data!$A:$P,H$8,FALSE)))","v":"NR"},{"$f":"IF($J18=\"NR\",\"NR\",(VLOOKUP($A$7&$C18&$A$11,Data!$A:$P,I$8,FALSE)))","v":"NR"},{"$f":"IF(VLOOKUP($A$7&$C18&\"Totals\",Data!$A:$P,I$8,FALSE)=0,\"NR\",(VLOOKUP($A$7&$C18&\"Totals\",Data!$A:$P,I$8,FALSE)))","v":"NR"},{"$f":"IF($Q18=\"NR\",\"NR\",(VLOOKUP($A$7&$C18&$A$11,Data!$A:$P,K$8,FALSE)))","v":"NR"},{"$f":"IF($Q18=\"NR\",\"NR\",(VLOOKUP($A$7&$C18&$A$11,Data!$A:$P,L$8,FALSE)))","v":"NR"},{"$f":"IF($Q18=\"NR\",\"NR\",(VLOOKUP($A$7&$C18&$A$11,Data!$A:$P,M$8,FALSE)))","v":"NR"},{"$f":"IF($Q18=\"NR\",\"NR\",(VLOOKUP($A$7&$C18&$A$11,Data!$A:$P,N$8,FALSE)))","v":"NR"},{"$f":"IF($Q18=\"NR\",\"NR\",(VLOOKUP($A$7&$C18&$A$11,Data!$A:$P,O$8,FALSE)))","v":"NR"},{"$f":"IF($Q18=\"NR\",\"NR\",(VLOOKUP($A$7&$C18&$A$11,Data!$A:$P,P$8,FALSE)))","v":"NR"},{"$f":"IF(VLOOKUP($A$7&$C18&\"Totals\",Data!$A:$P,P$8,FALSE)=0,\"NR\",(VLOOKUP($A$7&$C18&\"Totals\",Data!$A:$P,P$8,FALSE)))","v":"NR"}]
[null,null,"East Dunbartonshire",{"$f":"IF($J19=\"NR\",\"NR\",(VLOOKUP($A$7&$C19&$A$11,Data!$A:$P,D$8,FALSE)))","v":0.28000000000000003},{"$f":"IF($J19=\"NR\",\"NR\",(VLOOKUP($A$7&$C19&$A$11,Data!$A:$P,E$8,FALSE)))","v":0.27},{"$f":"IF($J19=\"NR\",\"NR\",(VLOOKUP($A$7&$C19&$A$11,Data!$A:$P,F$8,FALSE)))","v":0.16},{"$f":"IF($J19=\"NR\",\"NR\",(VLOOKUP($A$7&$C19&$A$11,Data!$A:$P,G$8,FALSE)))","v":7.0000000000000007E-2},{"$f":"IF($J19=\"NR\",\"NR\",(VLOOKUP($A$7&$C19&$A$11,Data!$A:$P,H$8,FALSE)))","v":0.23},{"$f":"IF($J19=\"NR\",\"NR\",(VLOOKUP($A$7&$C19&$A$11,Data!$A:$P,I$8,FALSE)))","v":1},{"$f":"IF(VLOOKUP($A$7&$C19&\"Totals\",Data!$A:$P,I$8,FALSE)=0,\"NR\",(VLOOKUP($A$7&$C19&\"Totals\",Data!$A:$P,I$8,FALSE)))","v":1},{"$f":"IF($Q19=\"NR\",\"NR\",(VLOOKUP($A$7&$C19&$A$11,Data!$A:$P,K$8,FALSE)))","v":0},{"$f":"IF($Q19=\"NR\",\"NR\",(VLOOKUP($A$7&$C19&$A$11,Data!$A:$P,L$8,FALSE)))","v":0.97},{"$f":"IF($Q19=\"NR\",\"NR\",(VLOOKUP($A$7&$C19&$A$11,Data!$A:$P,M$8,FALSE)))","v":0.01},{"$f":"IF($Q19=\"NR\",\"NR\",(VLOOKUP($A$7&$C19&$A$11,Data!$A:$P,N$8,FALSE)))","v":0.02},{"$f":"IF($Q19=\"NR\",\"NR\",(VLOOKUP($A$7&$C19&$A$11,Data!$A:$P,O$8,FALSE)))","v":0.01},{"$f":"IF($Q19=\"NR\",\"NR\",(VLOOKUP($A$7&$C19&$A$11,Data!$A:$P,P$8,FALSE)))","v":1},{"$f":"IF(VLOOKUP($A$7&$C19&\"Totals\",Data!$A:$P,P$8,FALSE)=0,\"NR\",(VLOOKUP($A$7&$C19&\"Totals\",Data!$A:$P,P$8,FALSE)))","v":1}]
[null,null,"East Lothian",{"$f":"IF($J20=\"NR\",\"NR\",(VLOOKUP($A$7&$C20&$A$11,Data!$A:$P,D$8,FALSE)))","v":0.22},{"$f":"IF($J20=\"NR\",\"NR\",(VLOOKUP($A$7&$C20&$A$11,Data!$A:$P,E$8,FALSE)))","v":0.17},{"$f":"IF($J20=\"NR\",\"NR\",(VLOOKUP($A$7&$C20&$A$11,Data!$A:$P,F$8,FALSE)))","v":0.18},{"$f":"IF($J20=\"NR\",\"NR\",(VLOOKUP($A$7&$C20&$A$11,Data!$A:$P,G$8,FALSE)))","v":0.21},{"$f":"IF($J20=\"NR\",\"NR\",(VLOOKUP($A$7&$C20&$A$11,Data!$A:$P,H$8,FALSE)))","v":0.22},{"$f":"IF($J20=\"NR\",\"NR\",(VLOOKUP($A$7&$C20&$A$11,Data!$A:$P,I$8,FALSE)))","v":1},{"$f":"IF(VLOOKUP($A$7&$C20&\"Totals\",Data!$A:$P,I$8,FALSE)=0,\"NR\",(VLOOKUP($A$7&$C20&\"Totals\",Data!$A:$P,I$8,FALSE)))","v":1},{"$f":"IF($Q20=\"NR\",\"NR\",(VLOOKUP($A$7&$C20&$A$11,Data!$A:$P,K$8,FALSE)))","v":0.28999999999999998},{"$f":"IF($Q20=\"NR\",\"NR\",(VLOOKUP($A$7&$C20&$A$11,Data!$A:$P,L$8,FALSE)))","v":0.42},{"$f":"IF($Q20=\"NR\",\"NR\",(VLOOKUP($A$7&$C20&$A$11,Data!$A:$P,M$8,FALSE)))","v":0.2},{"$f":"IF($Q20=\"NR\",\"NR\",(VLOOKUP($A$7&$C20&$A$11,Data!$A:$P,N$8,FALSE)))","v":0.1},{"$f":"IF($Q20=\"NR\",\"NR\",(VLOOKUP($A$7&$C20&$A$11,Data!$A:$P,O$8,FALSE)))","v":0},{"$f":"IF($Q20=\"NR\",\"NR\",(VLOOKUP($A$7&$C20&$A$11,Data!$A:$P,P$8,FALSE)))","v":1},{"$f":"IF(VLOOKUP($A$7&$C20&\"Totals\",Data!$A:$P,P$8,FALSE)=0,\"NR\",(VLOOKUP($A$7&$C20&\"Totals\",Data!$A:$P,P$8,FALSE)))","v":1}]
[null,null,"East Renfrewshire",{"$f":"IF($J21=\"NR\",\"NR\",(VLOOKUP($A$7&$C21&$A$11,Data!$A:$P,D$8,FALSE)))","v":"NR"},{"$f":"IF($J21=\"NR\",\"NR\",(VLOOKUP($A$7&$C21&$A$11,Data!$A:$P,E$8,FALSE)))","v":"NR"},{"$f":"IF($J21=\"NR\",\"NR\",(VLOOKUP($A$7&$C21&$A$11,Data!$A:$P,F$8,FALSE)))","v":"NR"},{"$f":"IF($J21=\"NR\",\"NR\",(VLOOKUP($A$7&$C21&$A$11,Data!$A:$P,G$8,FALSE)))","v":"NR"},{"$f":"IF($J21=\"NR\",\"NR\",(VLOOKUP($A$7&$C21&$A$11,Data!$A:$P,H$8,FALSE)))","v":"NR"},{"$f":"IF($J21=\"NR\",\"NR\",(VLOOKUP($A$7&$C21&$A$11,Data!$A:$P,I$8,FALSE)))","v":"NR"},{"$f":"IF(VLOOKUP($A$7&$C21&\"Totals\",Data!$A:$P,I$8,FALSE)=0,\"NR\",(VLOOKUP($A$7&$C21&\"Totals\",Data!$A:$P,I$8,FALSE)))","v":"NR"},{"$f":"IF($Q21=\"NR\",\"NR\",(VLOOKUP($A$7&$C21&$A$11,Data!$A:$P,K$8,FALSE)))","v":"NR"},{"$f":"IF($Q21=\"NR\",\"NR\",(VLOOKUP($A$7&$C21&$A$11,Data!$A:$P,L$8,FALSE)))","v":"NR"},{"$f":"IF($Q21=\"NR\",\"NR\",(VLOOKUP($A$7&$C21&$A$11,Data!$A:$P,M$8,FALSE)))","v":"NR"},{"$f":"IF($Q21=\"NR\",\"NR\",(VLOOKUP($A$7&$C21&$A$11,Data!$A:$P,N$8,FALSE)))","v":"NR"},{"$f":"IF($Q21=\"NR\",\"NR\",(VLOOKUP($A$7&$C21&$A$11,Data!$A:$P,O$8,FALSE)))","v":"NR"},{"$f":"IF($Q21=\"NR\",\"NR\",(VLOOKUP($A$7&$C21&$A$11,Data!$A:$P,P$8,FALSE)))","v":"NR"},{"$f":"IF(VLOOKUP($A$7&$C21&\"Totals\",Data!$A:$P,P$8,FALSE)=0,\"NR\",(VLOOKUP($A$7&$C21&\"Totals\",Data!$A:$P,P$8,FALSE)))","v":"NR"}]
[null,null,"Edinburgh, City of",{"$f":"IF($J22=\"NR\",\"NR\",(VLOOKUP($A$7&$C22&$A$11,Data!$A:$P,D$8,FALSE)))","v":0.35},{"$f":"IF($J22=\"NR\",\"NR\",(VLOOKUP($A$7&$C22&$A$11,Data!$A:$P,E$8,FALSE)))","v":0.39},{"$f":"IF($J22=\"NR\",\"NR\",(VLOOKUP($A$7&$C22&$A$11,Data!$A:$P,F$8,FALSE)))","v":0.15},{"$f":"IF($J22=\"NR\",\"NR\",(VLOOKUP($A$7&$C22&$A$11,Data!$A:$P,G$8,FALSE)))","v":0.05},{"$f":"IF($J22=\"NR\",\"NR\",(VLOOKUP($A$7&$C22&$A$11,Data!$A:$P,H$8,FALSE)))","v":7.0000000000000007E-2},{"$f":"IF($J22=\"NR\",\"NR\",(VLOOKUP($A$7&$C22&$A$11,Data!$A:$P,I$8,FALSE)))","v":1},{"$f":"IF(VLOOKUP($A$7&$C22&\"Totals\",Data!$A:$P,I$8,FALSE)=0,\"NR\",(VLOOKUP($A$7&$C22&\"Totals\",Data!$A:$P,I$8,FALSE)))","v":1},{"$f":"IF($Q22=\"NR\",\"NR\",(VLOOKUP($A$7&$C22&$A$11,Data!$A:$P,K$8,FALSE)))","v":0.02},{"$f":"IF($Q22=\"NR\",\"NR\",(VLOOKUP($A$7&$C22&$A$11,Data!$A:$P,L$8,FALSE)))","v":0.49},{"$f":"IF($Q22=\"NR\",\"NR\",(VLOOKUP($A$7&$C22&$A$11,Data!$A:$P,M$8,FALSE)))","v":0.17},{"$f":"IF($Q22=\"NR\",\"NR\",(VLOOKUP($A$7&$C22&$A$11,Data!$A:$P,N$8,FALSE)))","v":0.1},{"$f":"IF($Q22=\"NR\",\"NR\",(VLOOKUP($A$7&$C22&$A$11,Data!$A:$P,O$8,FALSE)))","v":0.22},{"$f":"IF($Q22=\"NR\",\"NR\",(VLOOKUP($A$7&$C22&$A$11,Data!$A:$P,P$8,FALSE)))","v":1},{"$f":"IF(VLOOKUP($A$7&$C22&\"Totals\",Data!$A:$P,P$8,FALSE)=0,\"NR\",(VLOOKUP($A$7&$C22&\"Totals\",Data!$A:$P,P$8,FALSE)))","v":1}]
[null,null,"Eilean Siar",{"$f":"IF($J23=\"NR\",\"NR\",(VLOOKUP($A$7&$C23&$A$11,Data!$A:$P,D$8,FALSE)))","v":0.16},{"$f":"IF($J23=\"NR\",\"NR\",(VLOOKUP($A$7&$C23&$A$11,Data!$A:$P,E$8,FALSE)))","v":0.45},{"$f":"IF($J23=\"NR\",\"NR\",(VLOOKUP($A$7&$C23&$A$11,Data!$A:$P,F$8,FALSE)))","v":0.16},{"$f":"IF($J23=\"NR\",\"NR\",(VLOOKUP($A$7&$C23&$A$11,Data!$A:$P,G$8,FALSE)))","v":0.13},{"$f":"IF($J23=\"NR\",\"NR\",(VLOOKUP($A$7&$C23&$A$11,Data!$A:$P,H$8,FALSE)))","v":0.1},{"$f":"IF($J23=\"NR\",\"NR\",(VLOOKUP($A$7&$C23&$A$11,Data!$A:$P,I$8,FALSE)))","v":1},{"$f":"IF(VLOOKUP($A$7&$C23&\"Totals\",Data!$A:$P,I$8,FALSE)=0,\"NR\",(VLOOKUP($A$7&$C23&\"Totals\",Data!$A:$P,I$8,FALSE)))","v":1},{"$f":"IF($Q23=\"NR\",\"NR\",(VLOOKUP($A$7&$C23&$A$11,Data!$A:$P,K$8,FALSE)))","v":0.2},{"$f":"IF($Q23=\"NR\",\"NR\",(VLOOKUP($A$7&$C23&$A$11,Data!$A:$P,L$8,FALSE)))","v":0.6},{"$f":"IF($Q23=\"NR\",\"NR\",(VLOOKUP($A$7&$C23&$A$11,Data!$A:$P,M$8,FALSE)))","v":7.0000000000000007E-2},{"$f":"IF($Q23=\"NR\",\"NR\",(VLOOKUP($A$7&$C23&$A$11,Data!$A:$P,N$8,FALSE)))","v":0.03},{"$f":"IF($Q23=\"NR\",\"NR\",(VLOOKUP($A$7&$C23&$A$11,Data!$A:$P,O$8,FALSE)))","v":0.1},{"$f":"IF($Q23=\"NR\",\"NR\",(VLOOKUP($A$7&$C23&$A$11,Data!$A:$P,P$8,FALSE)))","v":1},{"$f":"IF(VLOOKUP($A$7&$C23&\"Totals\",Data!$A:$P,P$8,FALSE)=0,\"NR\",(VLOOKUP($A$7&$C23&\"Totals\",Data!$A:$P,P$8,FALSE)))","v":1}]
[null,null,"Falkirk",{"$f":"IF($J24=\"NR\",\"NR\",(VLOOKUP($A$7&$C24&$A$11,Data!$A:$P,D$8,FALSE)))","v":0.05},{"$f":"IF($J24=\"NR\",\"NR\",(VLOOKUP($A$7&$C24&$A$11,Data!$A:$P,E$8,FALSE)))","v":0.15},{"$f":"IF($J24=\"NR\",\"NR\",(VLOOKUP($A$7&$C24&$A$11,Data!$A:$P,F$8,FALSE)))","v":0.13},{"$f":"IF($J24=\"NR\",\"NR\",(VLOOKUP($A$7&$C24&$A$11,Data!$A:$P,G$8,FALSE)))","v":0.1},{"$f":"IF($J24=\"NR\",\"NR\",(VLOOKUP($A$7&$C24&$A$11,Data!$A:$P,H$8,FALSE)))","v":0.56999999999999995},{"$f":"IF($J24=\"NR\",\"NR\",(VLOOKUP($A$7&$C24&$A$11,Data!$A:$P,I$8,FALSE)))","v":1},{"$f":"IF(VLOOKUP($A$7&$C24&\"Totals\",Data!$A:$P,I$8,FALSE)=0,\"NR\",(VLOOKUP($A$7&$C24&\"Totals\",Data!$A:$P,I$8,FALSE)))","v":1},{"$f":"IF($Q24=\"NR\",\"NR\",(VLOOKUP($A$7&$C24&$A$11,Data!$A:$P,K$8,FALSE)))","v":1},{"$f":"IF($Q24=\"NR\",\"NR\",(VLOOKUP($A$7&$C24&$A$11,Data!$A:$P,L$8,FALSE)))","v":0},{"$f":"IF($Q24=\"NR\",\"NR\",(VLOOKUP($A$7&$C24&$A$11,Data!$A:$P,M$8,FALSE)))","v":0},{"$f":"IF($Q24=\"NR\",\"NR\",(VLOOKUP($A$7&$C24&$A$11,Data!$A:$P,N$8,FALSE)))","v":0},{"$f":"IF($Q24=\"NR\",\"NR\",(VLOOKUP($A$7&$C24&$A$11,Data!$A:$P,O$8,FALSE)))","v":0},{"$f":"IF($Q24=\"NR\",\"NR\",(VLOOKUP($A$7&$C24&$A$11,Data!$A:$P,P$8,FALSE)))","v":1},{"$f":"IF(VLOOKUP($A$7&$C24&\"Totals\",Data!$A:$P,P$8,FALSE)=0,\"NR\",(VLOOKUP($A$7&$C24&\"Totals\",Data!$A:$P,P$8,FALSE)))","v":1}]
[null,null,"Fife",{"$f":"IF($J25=\"NR\",\"NR\",(VLOOKUP($A$7&$C25&$A$11,Data!$A:$P,D$8,FALSE)))","v":0.18},{"$f":"IF($J25=\"NR\",\"NR\",(VLOOKUP($A$7&$C25&$A$11,Data!$A:$P,E$8,FALSE)))","v":0.35},{"$f":"IF($J25=\"NR\",\"NR\",(VLOOKUP($A$7&$C25&$A$11,Data!$A:$P,F$8,FALSE)))","v":0.13},{"$f":"IF($J25=\"NR\",\"NR\",(VLOOKUP($A$7&$C25&$A$11,Data!$A:$P,G$8,FALSE)))","v":0.11},{"$f":"IF($J25=\"NR\",\"NR\",(VLOOKUP($A$7&$C25&$A$11,Data!$A:$P,H$8,FALSE)))","v":0.24},{"$f":"IF($J25=\"NR\",\"NR\",(VLOOKUP($A$7&$C25&$A$11,Data!$A:$P,I$8,FALSE)))","v":1},{"$f":"IF(VLOOKUP($A$7&$C25&\"Totals\",Data!$A:$P,I$8,FALSE)=0,\"NR\",(VLOOKUP($A$7&$C25&\"Totals\",Data!$A:$P,I$8,FALSE)))","v":1},{"$f":"IF($Q25=\"NR\",\"NR\",(VLOOKUP($A$7&$C25&$A$11,Data!$A:$P,K$8,FALSE)))","v":0.05},{"$f":"IF($Q25=\"NR\",\"NR\",(VLOOKUP($A$7&$C25&$A$11,Data!$A:$P,L$8,FALSE)))","v":0.51},{"$f":"IF($Q25=\"NR\",\"NR\",(VLOOKUP($A$7&$C25&$A$11,Data!$A:$P,M$8,FALSE)))","v":0.28999999999999998},{"$f":"IF($Q25=\"NR\",\"NR\",(VLOOKUP($A$7&$C25&$A$11,Data!$A:$P,N$8,FALSE)))","v":0.13},{"$f":"IF($Q25=\"NR\",\"NR\",(VLOOKUP($A$7&$C25&$A$11,Data!$A:$P,O$8,FALSE)))","v":0.01},{"$f":"IF($Q25=\"NR\",\"NR\",(VLOOKUP($A$7&$C25&$A$11,Data!$A:$P,P$8,FALSE)))","v":1},{"$f":"IF(VLOOKUP($A$7&$C25&\"Totals\",Data!$A:$P,P$8,FALSE)=0,\"NR\",(VLOOKUP($A$7&$C25&\"Totals\",Data!$A:$P,P$8,FALSE)))","v":1}]
[null,null,"Glasgow City",{"$f":"IF($J26=\"NR\",\"NR\",(VLOOKUP($A$7&$C26&$A$11,Data!$A:$P,D$8,FALSE)))","v":0.13},{"$f":"IF($J26=\"NR\",\"NR\",(VLOOKUP($A$7&$C26&$A$11,Data!$A:$P,E$8,FALSE)))","v":0.4},{"$f":"IF($J26=\"NR\",\"NR\",(VLOOKUP($A$7&$C26&$A$11,Data!$A:$P,F$8,FALSE)))","v":0.17},{"$f":"IF($J26=\"NR\",\"NR\",(VLOOKUP($A$7&$C26&$A$11,Data!$A:$P,G$8,FALSE)))","v":7.0000000000000007E-2},{"$f":"IF($J26=\"NR\",\"NR\",(VLOOKUP($A$7&$C26&$A$11,Data!$A:$P,H$8,FALSE)))","v":0.24},{"$f":"IF($J26=\"NR\",\"NR\",(VLOOKUP($A$7&$C26&$A$11,Data!$A:$P,I$8,FALSE)))","v":1},{"$f":"IF(VLOOKUP($A$7&$C26&\"Totals\",Data!$A:$P,I$8,FALSE)=0,\"NR\",(VLOOKUP($A$7&$C26&\"Totals\",Data!$A:$P,I$8,FALSE)))","v":1},{"$f":"IF($Q26=\"NR\",\"NR\",(VLOOKUP($A$7&$C26&$A$11,Data!$A:$P,K$8,FALSE)))","v":0},{"$f":"IF($Q26=\"NR\",\"NR\",(VLOOKUP($A$7&$C26&$A$11,Data!$A:$P,L$8,FALSE)))","v":1},{"$f":"IF($Q26=\"NR\",\"NR\",(VLOOKUP($A$7&$C26&$A$11,Data!$A:$P,M$8,FALSE)))","v":0},{"$f":"IF($Q26=\"NR\",\"NR\",(VLOOKUP($A$7&$C26&$A$11,Data!$A:$P,N$8,FALSE)))","v":0},{"$f":"IF($Q26=\"NR\",\"NR\",(VLOOKUP($A$7&$C26&$A$11,Data!$A:$P,O$8,FALSE)))","v":0},{"$f":"IF($Q26=\"NR\",\"NR\",(VLOOKUP($A$7&$C26&$A$11,Data!$A:$P,P$8,FALSE)))","v":1},{"$f":"IF(VLOOKUP($A$7&$C26&\"Totals\",Data!$A:$P,P$8,FALSE)=0,\"NR\",(VLOOKUP($A$7&$C26&\"Totals\",Data!$A:$P,P$8,FALSE)))","v":1}]
[null,null,"Highland",{"$f":"IF($J27=\"NR\",\"NR\",(VLOOKUP($A$7&$C27&$A$11,Data!$A:$P,D$8,FALSE)))","v":0.04},{"$f":"IF($J27=\"NR\",\"NR\",(VLOOKUP($A$7&$C27&$A$11,Data!$A:$P,E$8,FALSE)))","v":0.36},{"$f":"IF($J27=\"NR\",\"NR\",(VLOOKUP($A$7&$C27&$A$11,Data!$A:$P,F$8,FALSE)))","v":0.14000000000000001},{"$f":"IF($J27=\"NR\",\"NR\",(VLOOKUP($A$7&$C27&$A$11,Data!$A:$P,G$8,FALSE)))","v":0.11},{"$f":"IF($J27=\"NR\",\"NR\",(VLOOKUP($A$7&$C27&$A$11,Data!$A:$P,H$8,FALSE)))","v":0.36},{"$f":"IF($J27=\"NR\",\"NR\",(VLOOKUP($A$7&$C27&$A$11,Data!$A:$P,I$8,FALSE)))","v":1},{"$f":"IF(VLOOKUP($A$7&$C27&\"Totals\",Data!$A:$P,I$8,FALSE)=0,\"NR\",(VLOOKUP($A$7&$C27&\"Totals\",Data!$A:$P,I$8,FALSE)))","v":1},{"$f":"IF($Q27=\"NR\",\"NR\",(VLOOKUP($A$7&$C27&$A$11,Data!$A:$P,K$8,FALSE)))","v":"NR"},{"$f":"IF($Q27=\"NR\",\"NR\",(VLOOKUP($A$7&$C27&$A$11,Data!$A:$P,L$8,FALSE)))","v":"NR"},{"$f":"IF($Q27=\"NR\",\"NR\",(VLOOKUP($A$7&$C27&$A$11,Data!$A:$P,M$8,FALSE)))","v":"NR"},{"$f":"IF($Q27=\"NR\",\"NR\",(VLOOKUP($A$7&$C27&$A$11,Data!$A:$P,N$8,FALSE)))","v":"NR"},{"$f":"IF($Q27=\"NR\",\"NR\",(VLOOKUP($A$7&$C27&$A$11,Data!$A:$P,O$8,FALSE)))","v":"NR"},{"$f":"IF($Q27=\"NR\",\"NR\",(VLOOKUP($A$7&$C27&$A$11,Data!$A:$P,P$8,FALSE)))","v":"NR"},{"$f":"IF(VLOOKUP($A$7&$C27&\"Totals\",Data!$A:$P,P$8,FALSE)=0,\"NR\",(VLOOKUP($A$7&$C27&\"Totals\",Data!$A:$P,P$8,FALSE)))","v":"NR"}]
[null,null,"Inverclyde",{"$f":"IF($J28=\"NR\",\"NR\",(VLOOKUP($A$7&$C28&$A$11,Data!$A:$P,D$8,FALSE)))","v":0.13},{"$f":"IF($J28=\"NR\",\"NR\",(VLOOKUP($A$7&$C28&$A$11,Data!$A:$P,E$8,FALSE)))","v":0.39},{"$f":"IF($J28=\"NR\",\"NR\",(VLOOKUP($A$7&$C28&$A$11,Data!$A:$P,F$8,FALSE)))","v":0.08},{"$f":"IF($J28=\"NR\",\"NR\",(VLOOKUP($A$7&$C28&$A$11,Data!$A:$P,G$8,FALSE)))","v":0.23},{"$f":"IF($J28=\"NR\",\"NR\",(VLOOKUP($A$7&$C28&$A$11,Data!$A:$P,H$8,FALSE)))","v":0.17},{"$f":"IF($J28=\"NR\",\"NR\",(VLOOKUP($A$7&$C28&$A$11,Data!$A:$P,I$8,FALSE)))","v":1},{"$f":"IF(VLOOKUP($A$7&$C28&\"Totals\",Data!$A:$P,I$8,FALSE)=0,\"NR\",(VLOOKUP($A$7&$C28&\"Totals\",Data!$A:$P,I$8,FALSE)))","v":1},{"$f":"IF($Q28=\"NR\",\"NR\",(VLOOKUP($A$7&$C28&$A$11,Data!$A:$P,K$8,FALSE)))","v":0.13},{"$f":"IF($Q28=\"NR\",\"NR\",(VLOOKUP($A$7&$C28&$A$11,Data!$A:$P,L$8,FALSE)))","v":0.82},{"$f":"IF($Q28=\"NR\",\"NR\",(VLOOKUP($A$7&$C28&$A$11,Data!$A:$P,M$8,FALSE)))","v":0.06},{"$f":"IF($Q28=\"NR\",\"NR\",(VLOOKUP($A$7&$C28&$A$11,Data!$A:$P,N$8,FALSE)))","v":0},{"$f":"IF($Q28=\"NR\",\"NR\",(VLOOKUP($A$7&$C28&$A$11,Data!$A:$P,O$8,FALSE)))","v":0},{"$f":"IF($Q28=\"NR\",\"NR\",(VLOOKUP($A$7&$C28&$A$11,Data!$A:$P,P$8,FALSE)))","v":1},{"$f":"IF(VLOOKUP($A$7&$C28&\"Totals\",Data!$A:$P,P$8,FALSE)=0,\"NR\",(VLOOKUP($A$7&$C28&\"Totals\",Data!$A:$P,P$8,FALSE)))","v":1}]
[null,null,"Midlothian",{"$f":"IF($J29=\"NR\",\"NR\",(VLOOKUP($A$7&$C29&$A$11,Data!$A:$P,D$8,FALSE)))","v":0.01},{"$f":"IF($J29=\"NR\",\"NR\",(VLOOKUP($A$7&$C29&$A$11,Data!$A:$P,E$8,FALSE)))","v":0.08},{"$f":"IF($J29=\"NR\",\"NR\",(VLOOKUP($A$7&$C29&$A$11,Data!$A:$P,F$8,FALSE)))","v":0.16},{"$f":"IF($J29=\"NR\",\"NR\",(VLOOKUP($A$7&$C29&$A$11,Data!$A:$P,G$8,FALSE)))","v":0.13},{"$f":"IF($J29=\"NR\",\"NR\",(VLOOKUP($A$7&$C29&$A$11,Data!$A:$P,H$8,FALSE)))","v":0.62},{"$f":"IF($J29=\"NR\",\"NR\",(VLOOKUP($A$7&$C29&$A$11,Data!$A:$P,I$8,FALSE)))","v":1},{"$f":"IF(VLOOKUP($A$7&$C29&\"Totals\",Data!$A:$P,I$8,FALSE)=0,\"NR\",(VLOOKUP($A$7&$C29&\"Totals\",Data!$A:$P,I$8,FALSE)))","v":1},{"$f":"IF($Q29=\"NR\",\"NR\",(VLOOKUP($A$7&$C29&$A$11,Data!$A:$P,K$8,FALSE)))","v":0},{"$f":"IF($Q29=\"NR\",\"NR\",(VLOOKUP($A$7&$C29&$A$11,Data!$A:$P,L$8,FALSE)))","v":0},{"$f":"IF($Q29=\"NR\",\"NR\",(VLOOKUP($A$7&$C29&$A$11,Data!$A:$P,M$8,FALSE)))","v":0},{"$f":"IF($Q29=\"NR\",\"NR\",(VLOOKUP($A$7&$C29&$A$11,Data!$A:$P,N$8,FALSE)))","v":0},{"$f":"IF($Q29=\"NR\",\"NR\",(VLOOKUP($A$7&$C29&$A$11,Data!$A:$P,O$8,FALSE)))","v":1},{"$f":"IF($Q29=\"NR\",\"NR\",(VLOOKUP($A$7&$C29&$A$11,Data!$A:$P,P$8,FALSE)))","v":1},{"$f":"IF(VLOOKUP($A$7&$C29&\"Totals\",Data!$A:$P,P$8,FALSE)=0,\"NR\",(VLOOKUP($A$7&$C29&\"Totals\",Data!$A:$P,P$8,FALSE)))","v":1}]
[null,null,"Moray",{"$f":"IF($J30=\"NR\",\"NR\",(VLOOKUP($A$7&$C30&$A$11,Data!$A:$P,D$8,FALSE)))","v":0.24},{"$f":"IF($J30=\"NR\",\"NR\",(VLOOKUP($A$7&$C30&$A$11,Data!$A:$P,E$8,FALSE)))","v":0.22},{"$f":"IF($J30=\"NR\",\"NR\",(VLOOKUP($A$7&$C30&$A$11,Data!$A:$P,F$8,FALSE)))","v":0.18},{"$f":"IF($J30=\"NR\",\"NR\",(VLOOKUP($A$7&$C30&$A$11,Data!$A:$P,G$8,FALSE)))","v":0.17},{"$f":"IF($J30=\"NR\",\"NR\",(VLOOKUP($A$7&$C30&$A$11,Data!$A:$P,H$8,FALSE)))","v":0.19},{"$f":"IF($J30=\"NR\",\"NR\",(VLOOKUP($A$7&$C30&$A$11,Data!$A:$P,I$8,FALSE)))","v":1},{"$f":"IF(VLOOKUP($A$7&$C30&\"Totals\",Data!$A:$P,I$8,FALSE)=0,\"NR\",(VLOOKUP($A$7&$C30&\"Totals\",Data!$A:$P,I$8,FALSE)))","v":1},{"$f":"IF($Q30=\"NR\",\"NR\",(VLOOKUP($A$7&$C30&$A$11,Data!$A:$P,K$8,FALSE)))","v":0.36},{"$f":"IF($Q30=\"NR\",\"NR\",(VLOOKUP($A$7&$C30&$A$11,Data!$A:$P,L$8,FALSE)))","v":0.04},{"$f":"IF($Q30=\"NR\",\"NR\",(VLOOKUP($A$7&$C30&$A$11,Data!$A:$P,M$8,FALSE)))","v":0.04},{"$f":"IF($Q30=\"NR\",\"NR\",(VLOOKUP($A$7&$C30&$A$11,Data!$A:$P,N$8,FALSE)))","v":0.03},{"$f":"IF($Q30=\"NR\",\"NR\",(VLOOKUP($A$7&$C30&$A$11,Data!$A:$P,O$8,FALSE)))","v":0.53},{"$f":"IF($Q30=\"NR\",\"NR\",(VLOOKUP($A$7&$C30&$A$11,Data!$A:$P,P$8,FALSE)))","v":1},{"$f":"IF(VLOOKUP($A$7&$C30&\"Totals\",Data!$A:$P,P$8,FALSE)=0,\"NR\",(VLOOKUP($A$7&$C30&\"Totals\",Data!$A:$P,P$8,FALSE)))","v":1}]
[null,null,"North Ayrshire",{"$f":"IF($J31=\"NR\",\"NR\",(VLOOKUP($A$7&$C31&$A$11,Data!$A:$P,D$8,FALSE)))","v":"NR"},{"$f":"IF($J31=\"NR\",\"NR\",(VLOOKUP($A$7&$C31&$A$11,Data!$A:$P,E$8,FALSE)))","v":"NR"},{"$f":"IF($J31=\"NR\",\"NR\",(VLOOKUP($A$7&$C31&$A$11,Data!$A:$P,F$8,FALSE)))","v":"NR"},{"$f":"IF($J31=\"NR\",\"NR\",(VLOOKUP($A$7&$C31&$A$11,Data!$A:$P,G$8,FALSE)))","v":"NR"},{"$f":"IF($J31=\"NR\",\"NR\",(VLOOKUP($A$7&$C31&$A$11,Data!$A:$P,H$8,FALSE)))","v":"NR"},{"$f":"IF($J31=\"NR\",\"NR\",(VLOOKUP($A$7&$C31&$A$11,Data!$A:$P,I$8,FALSE)))","v":"NR"},{"$f":"IF(VLOOKUP($A$7&$C31&\"Totals\",Data!$A:$P,I$8,FALSE)=0,\"NR\",(VLOOKUP($A$7&$C31&\"Totals\",Data!$A:$P,I$8,FALSE)))","v":"NR"},{"$f":"IF($Q31=\"NR\",\"NR\",(VLOOKUP($A$7&$C31&$A$11,Data!$A:$P,K$8,FALSE)))","v":"NR"},{"$f":"IF($Q31=\"NR\",\"NR\",(VLOOKUP($A$7&$C31&$A$11,Data!$A:$P,L$8,FALSE)))","v":"NR"},{"$f":"IF($Q31=\"NR\",\"NR\",(VLOOKUP($A$7&$C31&$A$11,Data!$A:$P,M$8,FALSE)))","v":"NR"},{"$f":"IF($Q31=\"NR\",\"NR\",(VLOOKUP($A$7&$C31&$A$11,Data!$A:$P,N$8,FALSE)))","v":"NR"},{"$f":"IF($Q31=\"NR\",\"NR\",(VLOOKUP($A$7&$C31&$A$11,Data!$A:$P,O$8,FALSE)))","v":"NR"},{"$f":"IF($Q31=\"NR\",\"NR\",(VLOOKUP($A$7&$C31&$A$11,Data!$A:$P,P$8,FALSE)))","v":"NR"},{"$f":"IF(VLOOKUP($A$7&$C31&\"Totals\",Data!$A:$P,P$8,FALSE)=0,\"NR\",(VLOOKUP($A$7&$C31&\"Totals\",Data!$A:$P,P$8,FALSE)))","v":"NR"}]
[null,null,"North Lanarkshire",{"$f":"IF($J32=\"NR\",\"NR\",(VLOOKUP($A$7&$C32&$A$11,Data!$A:$P,D$8,FALSE)))","v":0.23},{"$f":"IF($J32=\"NR\",\"NR\",(VLOOKUP($A$7&$C32&$A$11,Data!$A:$P,E$8,FALSE)))","v":0.26},{"$f":"IF($J32=\"NR\",\"NR\",(VLOOKUP($A$7&$C32&$A$11,Data!$A:$P,F$8,FALSE)))","v":0.11},{"$f":"IF($J32=\"NR\",\"NR\",(VLOOKUP($A$7&$C32&$A$11,Data!$A:$P,G$8,FALSE)))","v":7.0000000000000007E-2},{"$f":"IF($J32=\"NR\",\"NR\",(VLOOKUP($A$7&$C32&$A$11,Data!$A:$P,H$8,FALSE)))","v":0.33},{"$f":"IF($J32=\"NR\",\"NR\",(VLOOKUP($A$7&$C32&$A$11,Data!$A:$P,I$8,FALSE)))","v":1},{"$f":"IF(VLOOKUP($A$7&$C32&\"Totals\",Data!$A:$P,I$8,FALSE)=0,\"NR\",(VLOOKUP($A$7&$C32&\"Totals\",Data!$A:$P,I$8,FALSE)))","v":1},{"$f":"IF($Q32=\"NR\",\"NR\",(VLOOKUP($A$7&$C32&$A$11,Data!$A:$P,K$8,FALSE)))","v":0.22},{"$f":"IF($Q32=\"NR\",\"NR\",(VLOOKUP($A$7&$C32&$A$11,Data!$A:$P,L$8,FALSE)))","v":0.68},{"$f":"IF($Q32=\"NR\",\"NR\",(VLOOKUP($A$7&$C32&$A$11,Data!$A:$P,M$8,FALSE)))","v":0.05},{"$f":"IF($Q32=\"NR\",\"NR\",(VLOOKUP($A$7&$C32&$A$11,Data!$A:$P,N$8,FALSE)))","v":0.01},{"$f":"IF($Q32=\"NR\",\"NR\",(VLOOKUP($A$7&$C32&$A$11,Data!$A:$P,O$8,FALSE)))","v":0.04},{"$f":"IF($Q32=\"NR\",\"NR\",(VLOOKUP($A$7&$C32&$A$11,Data!$A:$P,P$8,FALSE)))","v":1},{"$f":"IF(VLOOKUP($A$7&$C32&\"Totals\",Data!$A:$P,P$8,FALSE)=0,\"NR\",(VLOOKUP($A$7&$C32&\"Totals\",Data!$A:$P,P$8,FALSE)))","v":1}]
[null,null,"Orkney Islands",{"$f":"IF($J33=\"NR\",\"NR\",(VLOOKUP($A$7&$C33&$A$11,Data!$A:$P,D$8,FALSE)))","v":"NR"},{"$f":"IF($J33=\"NR\",\"NR\",(VLOOKUP($A$7&$C33&$A$11,Data!$A:$P,E$8,FALSE)))","v":"NR"},{"$f":"IF($J33=\"NR\",\"NR\",(VLOOKUP($A$7&$C33&$A$11,Data!$A:$P,F$8,FALSE)))","v":"NR"},{"$f":"IF($J33=\"NR\",\"NR\",(VLOOKUP($A$7&$C33&$A$11,Data!$A:$P,G$8,FALSE)))","v":"NR"},{"$f":"IF($J33=\"NR\",\"NR\",(VLOOKUP($A$7&$C33&$A$11,Data!$A:$P,H$8,FALSE)))","v":"NR"},{"$f":"IF($J33=\"NR\",\"NR\",(VLOOKUP($A$7&$C33&$A$11,Data!$A:$P,I$8,FALSE)))","v":"NR"},{"$f":"IF(VLOOKUP($A$7&$C33&\"Totals\",Data!$A:$P,I$8,FALSE)=0,\"NR\",(VLOOKUP($A$7&$C33&\"Totals\",Data!$A:$P,I$8,FALSE)))","v":"NR"},{"$f":"IF($Q33=\"NR\",\"NR\",(VLOOKUP($A$7&$C33&$A$11,Data!$A:$P,K$8,FALSE)))","v":"NR"},{"$f":"IF($Q33=\"NR\",\"NR\",(VLOOKUP($A$7&$C33&$A$11,Data!$A:$P,L$8,FALSE)))","v":"NR"},{"$f":"IF($Q33=\"NR\",\"NR\",(VLOOKUP($A$7&$C33&$A$11,Data!$A:$P,M$8,FALSE)))","v":"NR"},{"$f":"IF($Q33=\"NR\",\"NR\",(VLOOKUP($A$7&$C33&$A$11,Data!$A:$P,N$8,FALSE)))","v":"NR"},{"$f":"IF($Q33=\"NR\",\"NR\",(VLOOKUP($A$7&$C33&$A$11,Data!$A:$P,O$8,FALSE)))","v":"NR"},{"$f":"IF($Q33=\"NR\",\"NR\",(VLOOKUP($A$7&$C33&$A$11,Data!$A:$P,P$8,FALSE)))","v":"NR"},{"$f":"IF(VLOOKUP($A$7&$C33&\"Totals\",Data!$A:$P,P$8,FALSE)=0,\"NR\",(VLOOKUP($A$7&$C33&\"Totals\",Data!$A:$P,P$8,FALSE)))","v":"NR"}]
[null,null,"Perth & Kinross",{"$f":"IF($J34=\"NR\",\"NR\",(VLOOKUP($A$7&$C34&$A$11,Data!$A:$P,D$8,FALSE)))","v":0.28000000000000003},{"$f":"IF($J34=\"NR\",\"NR\",(VLOOKUP($A$7&$C34&$A$11,Data!$A:$P,E$8,FALSE)))","v":0.28000000000000003},{"$f":"IF($J34=\"NR\",\"NR\",(VLOOKUP($A$7&$C34&$A$11,Data!$A:$P,F$8,FALSE)))","v":0.14000000000000001},{"$f":"IF($J34=\"NR\",\"NR\",(VLOOKUP($A$7&$C34&$A$11,Data!$A:$P,G$8,FALSE)))","v":0.1},{"$f":"IF($J34=\"NR\",\"NR\",(VLOOKUP($A$7&$C34&$A$11,Data!$A:$P,H$8,FALSE)))","v":0.21},{"$f":"IF($J34=\"NR\",\"NR\",(VLOOKUP($A$7&$C34&$A$11,Data!$A:$P,I$8,FALSE)))","v":1},{"$f":"IF(VLOOKUP($A$7&$C34&\"Totals\",Data!$A:$P,I$8,FALSE)=0,\"NR\",(VLOOKUP($A$7&$C34&\"Totals\",Data!$A:$P,I$8,FALSE)))","v":1},{"$f":"IF($Q34=\"NR\",\"NR\",(VLOOKUP($A$7&$C34&$A$11,Data!$A:$P,K$8,FALSE)))","v":0.11},{"$f":"IF($Q34=\"NR\",\"NR\",(VLOOKUP($A$7&$C34&$A$11,Data!$A:$P,L$8,FALSE)))","v":0.59},{"$f":"IF($Q34=\"NR\",\"NR\",(VLOOKUP($A$7&$C34&$A$11,Data!$A:$P,M$8,FALSE)))","v":0.16},{"$f":"IF($Q34=\"NR\",\"NR\",(VLOOKUP($A$7&$C34&$A$11,Data!$A:$P,N$8,FALSE)))","v":0.04},{"$f":"IF($Q34=\"NR\",\"NR\",(VLOOKUP($A$7&$C34&$A$11,Data!$A:$P,O$8,FALSE)))","v":0.09},{"$f":"IF($Q34=\"NR\",\"NR\",(VLOOKUP($A$7&$C34&$A$11,Data!$A:$P,P$8,FALSE)))","v":1},{"$f":"IF(VLOOKUP($A$7&$C34&\"Totals\",Data!$A:$P,P$8,FALSE)=0,\"NR\",(VLOOKUP($A$7&$C34&\"Totals\",Data!$A:$P,P$8,FALSE)))","v":1}]
[null,null,"Renfrewshire",{"$f":"IF($J35=\"NR\",\"NR\",(VLOOKUP($A$7&$C35&$A$11,Data!$A:$P,D$8,FALSE)))","v":1},{"$f":"IF($J35=\"NR\",\"NR\",(VLOOKUP($A$7&$C35&$A$11,Data!$A:$P,E$8,FALSE)))","v":0},{"$f":"IF($J35=\"NR\",\"NR\",(VLOOKUP($A$7&$C35&$A$11,Data!$A:$P,F$8,FALSE)))","v":0},{"$f":"IF($J35=\"NR\",\"NR\",(VLOOKUP($A$7&$C35&$A$11,Data!$A:$P,G$8,FALSE)))","v":0},{"$f":"IF($J35=\"NR\",\"NR\",(VLOOKUP($A$7&$C35&$A$11,Data!$A:$P,H$8,FALSE)))","v":0},{"$f":"IF($J35=\"NR\",\"NR\",(VLOOKUP($A$7&$C35&$A$11,Data!$A:$P,I$8,FALSE)))","v":1},{"$f":"IF(VLOOKUP($A$7&$C35&\"Totals\",Data!$A:$P,I$8,FALSE)=0,\"NR\",(VLOOKUP($A$7&$C35&\"Totals\",Data!$A:$P,I$8,FALSE)))","v":1},{"$f":"IF($Q35=\"NR\",\"NR\",(VLOOKUP($A$7&$C35&$A$11,Data!$A:$P,K$8,FALSE)))","v":0},{"$f":"IF($Q35=\"NR\",\"NR\",(VLOOKUP($A$7&$C35&$A$11,Data!$A:$P,L$8,FALSE)))","v":0.82},{"$f":"IF($Q35=\"NR\",\"NR\",(VLOOKUP($A$7&$C35&$A$11,Data!$A:$P,M$8,FALSE)))","v":0.09},{"$f":"IF($Q35=\"NR\",\"NR\",(VLOOKUP($A$7&$C35&$A$11,Data!$A:$P,N$8,FALSE)))","v":0.05},{"$f":"IF($Q35=\"NR\",\"NR\",(VLOOKUP($A$7&$C35&$A$11,Data!$A:$P,O$8,FALSE)))","v":0.04},{"$f":"IF($Q35=\"NR\",\"NR\",(VLOOKUP($A$7&$C35&$A$11,Data!$A:$P,P$8,FALSE)))","v":1},{"$f":"IF(VLOOKUP($A$7&$C35&\"Totals\",Data!$A:$P,P$8,FALSE)=0,\"NR\",(VLOOKUP($A$7&$C35&\"Totals\",Data!$A:$P,P$8,FALSE)))","v":1}]
[null,null,"Scottish Borders",{"$f":"IF($J36=\"NR\",\"NR\",(VLOOKUP($A$7&$C36&$A$11,Data!$A:$P,D$8,FALSE)))","v":0.15},{"$f":"IF($J36=\"NR\",\"NR\",(VLOOKUP($A$7&$C36&$A$11,Data!$A:$P,E$8,FALSE)))","v":0.27},{"$f":"IF($J36=\"NR\",\"NR\",(VLOOKUP($A$7&$C36&$A$11,Data!$A:$P,F$8,FALSE)))","v":0.18},{"$f":"IF($J36=\"NR\",\"NR\",(VLOOKUP($A$7&$C36&$A$11,Data!$A:$P,G$8,FALSE)))","v":7.0000000000000007E-2},{"$f":"IF($J36=\"NR\",\"NR\",(VLOOKUP($A$7&$C36&$A$11,Data!$A:$P,H$8,FALSE)))","v":0.33},{"$f":"IF($J36=\"NR\",\"NR\",(VLOOKUP($A$7&$C36&$A$11,Data!$A:$P,I$8,FALSE)))","v":1},{"$f":"IF(VLOOKUP($A$7&$C36&\"Totals\",Data!$A:$P,I$8,FALSE)=0,\"NR\",(VLOOKUP($A$7&$C36&\"Totals\",Data!$A:$P,I$8,FALSE)))","v":1},{"$f":"IF($Q36=\"NR\",\"NR\",(VLOOKUP($A$7&$C36&$A$11,Data!$A:$P,K$8,FALSE)))","v":0.02},{"$f":"IF($Q36=\"NR\",\"NR\",(VLOOKUP($A$7&$C36&$A$11,Data!$A:$P,L$8,FALSE)))","v":0.83},{"$f":"IF($Q36=\"NR\",\"NR\",(VLOOKUP($A$7&$C36&$A$11,Data!$A:$P,M$8,FALSE)))","v":0.1},{"$f":"IF($Q36=\"NR\",\"NR\",(VLOOKUP($A$7&$C36&$A$11,Data!$A:$P,N$8,FALSE)))","v":0.03},{"$f":"IF($Q36=\"NR\",\"NR\",(VLOOKUP($A$7&$C36&$A$11,Data!$A:$P,O$8,FALSE)))","v":0.01},{"$f":"IF($Q36=\"NR\",\"NR\",(VLOOKUP($A$7&$C36&$A$11,Data!$A:$P,P$8,FALSE)))","v":1},{"$f":"IF(VLOOKUP($A$7&$C36&\"Totals\",Data!$A:$P,P$8,FALSE)=0,\"NR\",(VLOOKUP($A$7&$C36&\"Totals\",Data!$A:$P,P$8,FALSE)))","v":1}]
[null,null,"Shetland Islands",{"$f":"IF($J37=\"NR\",\"NR\",(VLOOKUP($A$7&$C37&$A$11,Data!$A:$P,D$8,FALSE)))","v":0.1},{"$f":"IF($J37=\"NR\",\"NR\",(VLOOKUP($A$7&$C37&$A$11,Data!$A:$P,E$8,FALSE)))","v":0.22},{"$f":"IF($J37=\"NR\",\"NR\",(VLOOKUP($A$7&$C37&$A$11,Data!$A:$P,F$8,FALSE)))","v":0.26},{"$f":"IF($J37=\"NR\",\"NR\",(VLOOKUP($A$7&$C37&$A$11,Data!$A:$P,G$8,FALSE)))","v":0.12},{"$f":"IF($J37=\"NR\",\"NR\",(VLOOKUP($A$7&$C37&$A$11,Data!$A:$P,H$8,FALSE)))","v":0.3},{"$f":"IF($J37=\"NR\",\"NR\",(VLOOKUP($A$7&$C37&$A$11,Data!$A:$P,I$8,FALSE)))","v":1},{"$f":"IF(VLOOKUP($A$7&$C37&\"Totals\",Data!$A:$P,I$8,FALSE)=0,\"NR\",(VLOOKUP($A$7&$C37&\"Totals\",Data!$A:$P,I$8,FALSE)))","v":1},{"$f":"IF($Q37=\"NR\",\"NR\",(VLOOKUP($A$7&$C37&$A$11,Data!$A:$P,K$8,FALSE)))","v":0.14000000000000001},{"$f":"IF($Q37=\"NR\",\"NR\",(VLOOKUP($A$7&$C37&$A$11,Data!$A:$P,L$8,FALSE)))","v":0.69},{"$f":"IF($Q37=\"NR\",\"NR\",(VLOOKUP($A$7&$C37&$A$11,Data!$A:$P,M$8,FALSE)))","v":0.1},{"$f":"IF($Q37=\"NR\",\"NR\",(VLOOKUP($A$7&$C37&$A$11,Data!$A:$P,N$8,FALSE)))","v":7.0000000000000007E-2},{"$f":"IF($Q37=\"NR\",\"NR\",(VLOOKUP($A$7&$C37&$A$11,Data!$A:$P,O$8,FALSE)))","v":0},{"$f":"IF($Q37=\"NR\",\"NR\",(VLOOKUP($A$7&$C37&$A$11,Data!$A:$P,P$8,FALSE)))","v":1},{"$f":"IF(VLOOKUP($A$7&$C37&\"Totals\",Data!$A:$P,P$8,FALSE)=0,\"NR\",(VLOOKUP($A$7&$C37&\"Totals\",Data!$A:$P,P$8,FALSE)))","v":1}]
[null,null,"South Ayrshire",{"$f":"IF($J38=\"NR\",\"NR\",(VLOOKUP($A$7&$C38&$A$11,Data!$A:$P,D$8,FALSE)))","v":"NR"},{"$f":"IF($J38=\"NR\",\"NR\",(VLOOKUP($A$7&$C38&$A$11,Data!$A:$P,E$8,FALSE)))","v":"NR"},{"$f":"IF($J38=\"NR\",\"NR\",(VLOOKUP($A$7&$C38&$A$11,Data!$A:$P,F$8,FALSE)))","v":"NR"},{"$f":"IF($J38=\"NR\",\"NR\",(VLOOKUP($A$7&$C38&$A$11,Data!$A:$P,G$8,FALSE)))","v":"NR"},{"$f":"IF($J38=\"NR\",\"NR\",(VLOOKUP($A$7&$C38&$A$11,Data!$A:$P,H$8,FALSE)))","v":"NR"},{"$f":"IF($J38=\"NR\",\"NR\",(VLOOKUP($A$7&$C38&$A$11,Data!$A:$P,I$8,FALSE)))","v":"NR"},{"$f":"IF(VLOOKUP($A$7&$C38&\"Totals\",Data!$A:$P,I$8,FALSE)=0,\"NR\",(VLOOKUP($A$7&$C38&\"Totals\",Data!$A:$P,I$8,FALSE)))","v":"NR"},{"$f":"IF($Q38=\"NR\",\"NR\",(VLOOKUP($A$7&$C38&$A$11,Data!$A:$P,K$8,FALSE)))","v":"NR"},{"$f":"IF($Q38=\"NR\",\"NR\",(VLOOKUP($A$7&$C38&$A$11,Data!$A:$P,L$8,FALSE)))","v":"NR"},{"$f":"IF($Q38=\"NR\",\"NR\",(VLOOKUP($A$7&$C38&$A$11,Data!$A:$P,M$8,FALSE)))","v":"NR"},{"$f":"IF($Q38=\"NR\",\"NR\",(VLOOKUP($A$7&$C38&$A$11,Data!$A:$P,N$8,FALSE)))","v":"NR"},{"$f":"IF($Q38=\"NR\",\"NR\",(VLOOKUP($A$7&$C38&$A$11,Data!$A:$P,O$8,FALSE)))","v":"NR"},{"$f":"IF($Q38=\"NR\",\"NR\",(VLOOKUP($A$7&$C38&$A$11,Data!$A:$P,P$8,FALSE)))","v":"NR"},{"$f":"IF(VLOOKUP($A$7&$C38&\"Totals\",Data!$A:$P,P$8,FALSE)=0,\"NR\",(VLOOKUP($A$7&$C38&\"Totals\",Data!$A:$P,P$8,FALSE)))","v":"NR"}]
[null,null,"South Lanarkshire",{"$f":"IF($J39=\"NR\",\"NR\",(VLOOKUP($A$7&$C39&$A$11,Data!$A:$P,D$8,FALSE)))","v":"NR"},{"$f":"IF($J39=\"NR\",\"NR\",(VLOOKUP($A$7&$C39&$A$11,Data!$A:$P,E$8,FALSE)))","v":"NR"},{"$f":"IF($J39=\"NR\",\"NR\",(VLOOKUP($A$7&$C39&$A$11,Data!$A:$P,F$8,FALSE)))","v":"NR"},{"$f":"IF($J39=\"NR\",\"NR\",(VLOOKUP($A$7&$C39&$A$11,Data!$A:$P,G$8,FALSE)))","v":"NR"},{"$f":"IF($J39=\"NR\",\"NR\",(VLOOKUP($A$7&$C39&$A$11,Data!$A:$P,H$8,FALSE)))","v":"NR"},{"$f":"IF($J39=\"NR\",\"NR\",(VLOOKUP($A$7&$C39&$A$11,Data!$A:$P,I$8,FALSE)))","v":"NR"},{"$f":"IF(VLOOKUP($A$7&$C39&\"Totals\",Data!$A:$P,I$8,FALSE)=0,\"NR\",(VLOOKUP($A$7&$C39&\"Totals\",Data!$A:$P,I$8,FALSE)))","v":"NR"},{"$f":"IF($Q39=\"NR\",\"NR\",(VLOOKUP($A$7&$C39&$A$11,Data!$A:$P,K$8,FALSE)))","v":"NR"},{"$f":"IF($Q39=\"NR\",\"NR\",(VLOOKUP($A$7&$C39&$A$11,Data!$A:$P,L$8,FALSE)))","v":"NR"},{"$f":"IF($Q39=\"NR\",\"NR\",(VLOOKUP($A$7&$C39&$A$11,Data!$A:$P,M$8,FALSE)))","v":"NR"},{"$f":"IF($Q39=\"NR\",\"NR\",(VLOOKUP($A$7&$C39&$A$11,Data!$A:$P,N$8,FALSE)))","v":"NR"},{"$f":"IF($Q39=\"NR\",\"NR\",(VLOOKUP($A$7&$C39&$A$11,Data!$A:$P,O$8,FALSE)))","v":"NR"},{"$f":"IF($Q39=\"NR\",\"NR\",(VLOOKUP($A$7&$C39&$A$11,Data!$A:$P,P$8,FALSE)))","v":"NR"},{"$f":"IF(VLOOKUP($A$7&$C39&\"Totals\",Data!$A:$P,P$8,FALSE)=0,\"NR\",(VLOOKUP($A$7&$C39&\"Totals\",Data!$A:$P,P$8,FALSE)))","v":"NR"}]
[null,null,"Stirling",{"$f":"IF($J40=\"NR\",\"NR\",(VLOOKUP($A$7&$C40&$A$11,Data!$A:$P,D$8,FALSE)))","v":0.73},{"$f":"IF($J40=\"NR\",\"NR\",(VLOOKUP($A$7&$C40&$A$11,Data!$A:$P,E$8,FALSE)))","v":0.03},{"$f":"IF($J40=\"NR\",\"NR\",(VLOOKUP($A$7&$C40&$A$11,Data!$A:$P,F$8,FALSE)))","v":0.02},{"$f":"IF($J40=\"NR\",\"NR\",(VLOOKUP($A$7&$C40&$A$11,Data!$A:$P,G$8,FALSE)))","v":0.03},{"$f":"IF($J40=\"NR\",\"NR\",(VLOOKUP($A$7&$C40&$A$11,Data!$A:$P,H$8,FALSE)))","v":0.19},{"$f":"IF($J40=\"NR\",\"NR\",(VLOOKUP($A$7&$C40&$A$11,Data!$A:$P,I$8,FALSE)))","v":1},{"$f":"IF(VLOOKUP($A$7&$C40&\"Totals\",Data!$A:$P,I$8,FALSE)=0,\"NR\",(VLOOKUP($A$7&$C40&\"Totals\",Data!$A:$P,I$8,FALSE)))","v":1},{"$f":"IF($Q40=\"NR\",\"NR\",(VLOOKUP($A$7&$C40&$A$11,Data!$A:$P,K$8,FALSE)))","v":0.16},{"$f":"IF($Q40=\"NR\",\"NR\",(VLOOKUP($A$7&$C40&$A$11,Data!$A:$P,L$8,FALSE)))","v":0.44},{"$f":"IF($Q40=\"NR\",\"NR\",(VLOOKUP($A$7&$C40&$A$11,Data!$A:$P,M$8,FALSE)))","v":0.26},{"$f":"IF($Q40=\"NR\",\"NR\",(VLOOKUP($A$7&$C40&$A$11,Data!$A:$P,N$8,FALSE)))","v":7.0000000000000007E-2},{"$f":"IF($Q40=\"NR\",\"NR\",(VLOOKUP($A$7&$C40&$A$11,Data!$A:$P,O$8,FALSE)))","v":7.0000000000000007E-2},{"$f":"IF($Q40=\"NR\",\"NR\",(VLOOKUP($A$7&$C40&$A$11,Data!$A:$P,P$8,FALSE)))","v":1},{"$f":"IF(VLOOKUP($A$7&$C40&\"Totals\",Data!$A:$P,P$8,FALSE)=0,\"NR\",(VLOOKUP($A$7&$C40&\"Totals\",Data!$A:$P,P$8,FALSE)))","v":1}]
[null,null,"West Dunbartonshire",{"$f":"IF($J41=\"NR\",\"NR\",(VLOOKUP($A$7&$C41&$A$11,Data!$A:$P,D$8,FALSE)))","v":0.11},{"$f":"IF($J41=\"NR\",\"NR\",(VLOOKUP($A$7&$C41&$A$11,Data!$A:$P,E$8,FALSE)))","v":0.16},{"$f":"IF($J41=\"NR\",\"NR\",(VLOOKUP($A$7&$C41&$A$11,Data!$A:$P,F$8,FALSE)))","v":0.1},{"$f":"IF($J41=\"NR\",\"NR\",(VLOOKUP($A$7&$C41&$A$11,Data!$A:$P,G$8,FALSE)))","v":0.1},{"$f":"IF($J41=\"NR\",\"NR\",(VLOOKUP($A$7&$C41&$A$11,Data!$A:$P,H$8,FALSE)))","v":0.52},{"$f":"IF($J41=\"NR\",\"NR\",(VLOOKUP($A$7&$C41&$A$11,Data!$A:$P,I$8,FALSE)))","v":1},{"$f":"IF(VLOOKUP($A$7&$C41&\"Totals\",Data!$A:$P,I$8,FALSE)=0,\"NR\",(VLOOKUP($A$7&$C41&\"Totals\",Data!$A:$P,I$8,FALSE)))","v":1},{"$f":"IF($Q41=\"NR\",\"NR\",(VLOOKUP($A$7&$C41&$A$11,Data!$A:$P,K$8,FALSE)))","v":0.75},{"$f":"IF($Q41=\"NR\",\"NR\",(VLOOKUP($A$7&$C41&$A$11,Data!$A:$P,L$8,FALSE)))","v":0.22},{"$f":"IF($Q41=\"NR\",\"NR\",(VLOOKUP($A$7&$C41&$A$11,Data!$A:$P,M$8,FALSE)))","v":0.02},{"$f":"IF($Q41=\"NR\",\"NR\",(VLOOKUP($A$7&$C41&$A$11,Data!$A:$P,N$8,FALSE)))","v":0},{"$f":"IF($Q41=\"NR\",\"NR\",(VLOOKUP($A$7&$C41&$A$11,Data!$A:$P,O$8,FALSE)))","v":0},{"$f":"IF($Q41=\"NR\",\"NR\",(VLOOKUP($A$7&$C41&$A$11,Data!$A:$P,P$8,FALSE)))","v":1},{"$f":"IF(VLOOKUP($A$7&$C41&\"Totals\",Data!$A:$P,P$8,FALSE)=0,\"NR\",(VLOOKUP($A$7&$C41&\"Totals\",Data!$A:$P,P$8,FALSE)))","v":1}]
[null,null,"West Lothian",{"$f":"IF($J42=\"NR\",\"NR\",(VLOOKUP($A$7&$C42&$A$11,Data!$A:$P,D$8,FALSE)))","v":0.31},{"$f":"IF($J42=\"NR\",\"NR\",(VLOOKUP($A$7&$C42&$A$11,Data!$A:$P,E$8,FALSE)))","v":0.51},{"$f":"IF($J42=\"NR\",\"NR\",(VLOOKUP($A$7&$C42&$A$11,Data!$A:$P,F$8,FALSE)))","v":0.1},{"$f":"IF($J42=\"NR\",\"NR\",(VLOOKUP($A$7&$C42&$A$11,Data!$A:$P,G$8,FALSE)))","v":0.02},{"$f":"IF($J42=\"NR\",\"NR\",(VLOOKUP($A$7&$C42&$A$11,Data!$A:$P,H$8,FALSE)))","v":0.05},{"$f":"IF($J42=\"NR\",\"NR\",(VLOOKUP($A$7&$C42&$A$11,Data!$A:$P,I$8,FALSE)))","v":1},{"$f":"IF(VLOOKUP($A$7&$C42&\"Totals\",Data!$A:$P,I$8,FALSE)=0,\"NR\",(VLOOKUP($A$7&$C42&\"Totals\",Data!$A:$P,I$8,FALSE)))","v":1},{"$f":"IF($Q42=\"NR\",\"NR\",(VLOOKUP($A$7&$C42&$A$11,Data!$A:$P,K$8,FALSE)))","v":0.05},{"$f":"IF($Q42=\"NR\",\"NR\",(VLOOKUP($A$7&$C42&$A$11,Data!$A:$P,L$8,FALSE)))","v":0.13},{"$f":"IF($Q42=\"NR\",\"NR\",(VLOOKUP($A$7&$C42&$A$11,Data!$A:$P,M$8,FALSE)))","v":0.31},{"$f":"IF($Q42=\"NR\",\"NR\",(VLOOKUP($A$7&$C42&$A$11,Data!$A:$P,N$8,FALSE)))","v":0.14000000000000001},{"$f":"IF($Q42=\"NR\",\"NR\",(VLOOKUP($A$7&$C42&$A$11,Data!$A:$P,O$8,FALSE)))","v":0.37},{"$f":"IF($Q42=\"NR\",\"NR\",(VLOOKUP($A$7&$C42&$A$11,Data!$A:$P,P$8,FALSE)))","v":1},{"$f":"IF(VLOOKUP($A$7&$C42&\"Totals\",Data!$A:$P,P$8,FALSE)=0,\"NR\",(VLOOKUP($A$7&$C42&\"Totals\",Data!$A:$P,P$8,FALSE)))","v":1}]
[null,null,"SCOTLAND",{"$f":"VLOOKUP($A$7&\"SCOTLAND TOTALS\"&$A$11,Data!$A:$P,D$8,FALSE)","v":0.26},{"$f":"VLOOKUP($A$7&\"SCOTLAND TOTALS\"&$A$11,Data!$A:$P,E$8,FALSE)","v":0.3},{"$f":"VLOOKUP($A$7&\"SCOTLAND TOTALS\"&$A$11,Data!$A:$P,F$8,FALSE)","v":0.13},{"$f":"VLOOKUP($A$7&\"SCOTLAND TOTALS\"&$A$11,Data!$A:$P,G$8,FALSE)","v":0.08},{"$f":"VLOOKUP($A$7&\"SCOTLAND TOTALS\"&$A$11,Data!$A:$P,H$8,FALSE)","v":0.22},{"$f":"VLOOKUP($A$7&\"SCOTLAND TOTALS\"&$A$11,Data!$A:$P,I$8,FALSE)","v":1},null,{"$f":"VLOOKUP($A$7&\"SCOTLAND TOTALS\"&$A$11,Data!$A:$P,K$8,FALSE)","v":0.13},{"$f":"VLOOKUP($A$7&\"SCOTLAND TOTALS\"&$A$11,Data!$A:$P,L$8,FALSE)","v":0.62},{"$f":"VLOOKUP($A$7&\"SCOTLAND TOTALS\"&$A$11,Data!$A:$P,M$8,FALSE)","v":0.11},{"$f":"VLOOKUP($A$7&\"SCOTLAND TOTALS\"&$A$11,Data!$A:$P,N$8,FALSE)","v":0.05},{"$f":"VLOOKUP($A$7&\"SCOTLAND TOTALS\"&$A$11,Data!$A:$P,O$8,FALSE)","v":0.09},{"$f":"VLOOKUP($A$7&\"SCOTLAND TOTALS\"&$A$11,Data!$A:$P,P$8,FALSE)","v":1}]
[null,null,"Source: Scottish Government Quarterly Monitoring Return"]
[null,null,"Percentages have been rounded to the nearest whole per cent."]
[null,null,"NR - No figures returned for quarter"]

{"sheet":"TableD - Time interval (EC)","index":3,"n_rows":16,"n_cols":16,"rows_kept":16,"cut":false,"hidden":false,"merged":[[5,10,5,15],[5,3,5,8],[0,1,0,14]]}
[null,{"$f":"\"Table D - Time intervals recorded for clients in \" &A2& \" between first contact and completion of assessment and between completion of assessment and service delivery. Quarter - \"&A9","v":"Table D - Time intervals recorded for clients in Scotland between first contact and completion of assessment and between completion of assessment and service delivery. Quarter - January to March 2018"}]
[{"$f":"OFFSET(LKPS!H2,A3,0)","v":"Scotland"}]
[33,null,"Select Quarter",null,null,"Select area"]
[{"$f":"IF(A3=33,\"SCOTLAND TOTALS\",(OFFSET(LKPS!H2,A3,0)))","v":"SCOTLAND TOTALS"}," "]
[null,null,null,5,6,7,8,9,10,null,11,12,13,14,15,16]
[7,null,null,"Time interval between first contact and completion of assessment",null,null,null,null,null,null,"Time interval between completion of assessment and service delivery"]
[{"$f":"OFFSET(LKPS!D2,A6,0)","v":"JantoMar18"}," ","Eligibility Category","Less than or equal to 2 days","More than 2 days and <= 2 weeks","More than 2 weeks and <= 4 weeks","More than 4 weeks and <= 6 weeks","More than 6 weeks","Total",null,"Before care assessment completed","Less than or equal to 2 weeks","More than 2 weeks and <= 4 weeks","More than 4 weeks and <= 6 weeks","More than 6 weeks ","Total"]
[null," ","Critical",{"$f":"VLOOKUP($A$7&$A$4&$C8,Data!$A:$P,D$5,FALSE)","v":0.3},{"$f":"VLOOKUP($A$7&$A$4&$C8,Data!$A:$P,E$5,FALSE)","v":0.37},{"$f":"VLOOKUP($A$7&$A$4&$C8,Data!$A:$P,F$5,FALSE)","v":0.13},{"$f":"VLOOKUP($A$7&$A$4&$C8,Data!$A:$P,G$5,FALSE)","v":0.06},{"$f":"VLOOKUP($A$7&$A$4&$C8,Data!$A:$P,H$5,FALSE)","v":0.13},{"$f":"VLOOKUP($A$7&$A$4&$C8,Data!$A:$P,I$5,FALSE)","v":1},null,{"$f":"IF($P$13=\"NR\",\"NR\",(VLOOKUP($A$7&$A$4&$C8,Data!$A:$P,K$5,FALSE)))","v":0.13},{"$f":"IF($P$13=\"NR\",\"NR\",(VLOOKUP($A$7&$A$4&$C8,Data!$A:$P,L$5,FALSE)))","v":0.59},{"$f":"IF($P$13=\"NR\",\"NR\",(VLOOKUP($A$7&$A$4&$C8,Data!$A:$P,M$5,FALSE)))","v":0.14000000000000001},{"$f":"IF($P$13=\"NR\",\"NR\",(VLOOKUP($A$7&$A$4&$C8,Data!$A:$P,N$5,FALSE)))","v":7.0000000000000007E-2},{"$f":"IF($P$13=\"NR\",\"NR\",(VLOOKUP($A$7&$A$4&$C8,Data!$A:$P,O$5,FALSE)))","v":0.08},{"$f":"IF($P$13=\"NR\",\"NR\",(VLOOKUP($A$7&$A$4&$C8,Data!$A:$P,P$5,FALSE)))","v":1}]
[{"$f":"OFFSET(LKPS!B2,A6,0)","v":"January to March 2018"},null,"Substantial",{"$f":"VLOOKUP($A$7&$A$4&$C9,Data!$A:$P,D$5,FALSE)","v":0.22},{"$f":"VLOOKUP($A$7&$A$4&$C9,Data!$A:$P,E$5,FALSE)","v":0.31},{"$f":"VLOOKUP($A$7&$A$4&$C9,Data!$A:$P,F$5,FALSE)","v":0.14000000000000001},{"$f":"VLOOKUP($A$7&$A$4&$C9,Data!$A:$P,G$5,FALSE)","v":0.09},{"$f":"VLOOKUP($A$7&$A$4&$C9,Data!$A:$P,H$5,FALSE)","v":0.24},{"$f":"VLOOKUP($A$7&$A$4&$C9,Data!$A:$P,I$5,FALSE)","v":1},null,{"$f":"IF($P$13=\"NR\",\"NR\",(VLOOKUP($A$7&$A$4&$C9,Data!$A:$P,K$5,FALSE)))","v":0.12},{"$f":"IF($P$13=\"NR\",\"NR\",(VLOOKUP($A$7&$A$4&$C9,Data!$A:$P,L$5,FALSE)))","v":0.68},{"$f":"IF($P$13=\"NR\",\"NR\",(VLOOKUP($A$7&$A$4&$C9,Data!$A:$P,M$5,FALSE)))","v":0.09},{"$f":"IF($P$13=\"NR\",\"NR\",(VLOOKUP($A$7&$A$4&$C9,Data!$A:$P,N$5,FALSE)))","v":0.03},{"$f":"IF($P$13=\"NR\",\"NR\",(VLOOKUP($A$7&$A$4&$C9,Data!$A:$P,O$5,FALSE)))","v":7.0000000000000007E-2},{"$f":"IF($P$13=\"NR\",\"NR\",(VLOOKUP($A$7&$A$4&$C9,Data!$A:$P,P$5,FALSE)))","v":1}]
[null,null,"Moderate",{"$f":"VLOOKUP($A$7&$A$4&$C10,Data!$A:$P,D$5,FALSE)","v":0.14000000000000001},{"$f":"VLOOKUP($A$7&$A$4&$C10,Data!$A:$P,E$5,FALSE)","v":0.2},{"$f":"VLOOKUP($A$7&$A$4&$C10,Data!$A:$P,F$5,FALSE)","v":0.12},{"$f":"VLOOKUP($A$7&$A$4&$C10,Data!$A:$P,G$5,FALSE)","v":0.1},{"$f":"VLOOKUP($A$7&$A$4&$C10,Data!$A:$P,H$5,FALSE)","v":0.44},{"$f":"VLOOKUP($A$7&$A$4&$C10,Data!$A:$P,I$5,FALSE)","v":1},null,{"$f":"IF($P$13=\"NR\",\"NR\",(VLOOKUP($A$7&$A$4&$C10,Data!$A:$P,K$5,FALSE)))","v":0.22},{"$f":"IF($P$13=\"NR\",\"NR\",(VLOOKUP($A$7&$A$4&$C10,Data!$A:$P,L$5,FALSE)))","v":0.55000000000000004},{"$f":"IF($P$13=\"NR\",\"NR\",(VLOOKUP($A$7&$A$4&$C10,Data!$A:$P,M$5,FALSE)))","v":0.14000000000000001},{"$f":"IF($P$13=\"NR\",\"NR\",(VLOOKUP($A$7&$A$4&$C10,Data!$A:$P,N$5,FALSE)))","v":0.03},{"$f":"IF($P$13=\"NR\",\"NR\",(VLOOKUP($A$7&$A$4&$C10,Data!$A:$P,O$5,FALSE)))","v":7.0000000000000007E-2},{"$f":"IF($P$13=\"NR\",\"NR\",(VLOOKUP($A$7&$A$4&$C10,Data!$A:$P,P$5,FALSE)))","v":1}]
[2011,null,"Low or No Risk",{"$f":"VLOOKUP($A$7&$A$4&$C11,Data!$A:$P,D$5,FALSE)","v":0.16},{"$f":"VLOOKUP($A$7&$A$4&$C11,Data!$A:$P,E$5,FALSE)","v":0.21},{"$f":"VLOOKUP($A$7&$A$4&$C11,Data!$A:$P,F$5,FALSE)","v":0.13},{"$f":"VLOOKUP($A$7&$A$4&$C11,Data!$A:$P,G$5,FALSE)","v":7.0000000000000007E-2},{"$f":"VLOOKUP($A$7&$A$4&$C11,Data!$A:$P,H$5,FALSE)","v":0.44},{"$f":"VLOOKUP($A$7&$A$4&$C11,Data!$A:$P,I$5,FALSE)","v":1},null,{"$f":"IF($P$13=\"NR\",\"NR\",(VLOOKUP($A$7&$A$4&$C11,Data!$A:$P,K$5,FALSE)))","v":0.25},{"$f":"IF($P$13=\"NR\",\"NR\",(VLOOKUP($A$7&$A$4&$C11,Data!$A:$P,L$5,FALSE)))","v":0.57999999999999996},{"$f":"IF($P$13=\"NR\",\"NR\",(VLOOKUP($A$7&$A$4&$C11,Data!$A:$P,M$5,FALSE)))","v":0.08},{"$f":"IF($P$13=\"NR\",\"NR\",(VLOOKUP($A$7&$A$4&$C11,Data!$A:$P,N$5,FALSE)))","v":0.02},{"$f":"IF($P$13=\"NR\",\"NR\",(VLOOKUP($A$7&$A$4&$C11,Data!$A:$P,O$5,FALSE)))","v":7.0000000000000007E-2},{"$f":"IF($P$13=\"NR\",\"NR\",(VLOOKUP($A$7&$A$4&$C11,Data!$A:$P,P$5,FALSE)))","v":1}]
[null,null,"Not available",{"$f":"VLOOKUP($A$7&$A$4&$C12,Data!$A:$P,D$5,FALSE)","v":0.41},{"$f":"VLOOKUP($A$7&$A$4&$C12,Data!$A:$P,E$5,FALSE)","v":0.22},{"$f":"VLOOKUP($A$7&$A$4&$C12,Data!$A:$P,F$5,FALSE)","v":0.13},{"$f":"VLOOKUP($A$7&$A$4&$C12,Data!$A:$P,G$5,FALSE)","v":7.0000000000000007E-2},{"$f":"VLOOKUP($A$7&$A$4&$C12,Data!$A:$P,H$5,FALSE)","v":0.17},{"$f":"VLOOKUP($A$7&$A$4&$C12,Data!$A:$P,I$5,FALSE)","v":1},null,{"$f":"IF($P$13=\"NR\",\"NR\",(VLOOKUP($A$7&$A$4&$C12,Data!$A:$P,K$5,FALSE)))","v":0.11},{"$f":"IF($P$13=\"NR\",\"NR\",(VLOOKUP($A$7&$A$4&$C12,Data!$A:$P,L$5,FALSE)))","v":0.56999999999999995},{"$f":"IF($P$13=\"NR\",\"NR\",(VLOOKUP($A$7&$A$4&$C12,Data!$A:$P,M$5,FALSE)))","v":0.11},{"$f":"IF($P$13=\"NR\",\"NR\",(VLOOKUP($A$7&$A$4&$C12,Data!$A:$P,N$5,FALSE)))","v":0.05},{"$f":"IF($P$13=\"NR\",\"NR\",(VLOOKUP($A$7&$A$4&$C12,Data!$A:$P,O$5,FALSE)))","v":0.15},{"$f":"IF($P$13=\"NR\",\"NR\",(VLOOKUP($A$7&$A$4&$C12,Data!$A:$P,P$5,FALSE)))","v":1}]
[null,null,"Total",{"$f":"VLOOKUP($A$7&$A$4&\"Totals\",Data!$A:$P,D$5,FALSE)","v":0.26},{"$f":"VLOOKUP($A$7&$A$4&\"Totals\",Data!$A:$P,E$5,FALSE)","v":0.3},{"$f":"VLOOKUP($A$7&$A$4&\"Totals\",Data!$A:$P,F$5,FALSE)","v":0.13},{"$f":"VLOOKUP($A$7&$A$4&\"Totals\",Data!$A:$P,G$5,FALSE)","v":0.08},{"$f":"VLOOKUP($A$7&$A$4&\"Totals\",Data!$A:$P,H$5,FALSE)","v":0.22},{"$f":"VLOOKUP($A$7&$A$4&\"Totals\",Data!$A:$P,I$5,FALSE)","v":1},null,{"$f":"IF($P$13=\"NR\",\"NR\",(VLOOKUP($A$7&$A$4&\"Totals\",Data!$A:$P,K$5,FALSE)))","v":0.13},{"$f":"IF($P$13=\"NR\",\"NR\",(VLOOKUP($A$7&$A$4&\"Totals\",Data!$A:$P,L$5,FALSE)))","v":0.62},{"$f":"IF($P$13=\"NR\",\"NR\",(VLOOKUP($A$7&$A$4&\"Totals\",Data!$A:$P,M$5,FALSE)))","v":0.11},{"$f":"IF($P$13=\"NR\",\"NR\",(VLOOKUP($A$7&$A$4&\"Totals\",Data!$A:$P,N$5,FALSE)))","v":0.05},{"$f":"IF($P$13=\"NR\",\"NR\",(VLOOKUP($A$7&$A$4&\"Totals\",Data!$A:$P,O$5,FALSE)))","v":0.09},{"$f":"IF(VLOOKUP($A$7&$A$4&\"Totals\",Data!$A:$P,P$5,FALSE)=0,\"NR\",VLOOKUP($A$7&$A$4&\"Totals\",Data!$A:$P,P$5,FALSE))","v":1}]
[null,null,"Source: Scottish Government Quarterly Monitoring Return"]
[null,null,"Percentages have been rounded to the nearest percentage point."]
[null,null,"NR - No figures returned for quarter"]

{"sheet":"LKPS","index":4,"n_rows":35,"n_cols":8,"rows_kept":35,"cut":false,"hidden":true,"merged":[]}
[]
[]
[null,"January to March 2012","January to March2012","JantoMar12",null,"Critical",null,"Aberdeen City"]
[null,"January to March 2013","January to March2013","JantoMar13",null,"Substantial",null,"Aberdeenshire"]
[null,"January to March 2014","January to March2014","JantoMar14",null,"Moderate",null,"Angus"]
[null,"January to March 2015","January to March2015","JantoMar15",null,"Low or No Risk",null,"Argyll & Bute"]
[null,"January to March 2016","January to March2016","JantoMar16",null,"Not available",null,"Clackmannanshire"]
[null,"January to March 2017","January to March2017","JantoMar17",null,"Totals",null,"Dumfries and Galloway"]
[null,"January to March 2018","January to March2018","JantoMar18",null,null,null,"Dundee City"]
[null,null,null,null,null,null,null,"East Ayrshire"]
[null,null,null,null,null,null,null,"East Dunbartonshire"]
[null,null,null,null,null,null,null,"East Lothian"]
[null,null,null,null,null,null,null,"East Renfrewshire"]
[null,null,null,null,null,null,null,"Edinburgh, City of"]
[null,null,null,null,null,null,null,"Eilean Siar"]
[null,null,null,null,null,null,null,"Falkirk"]
[null,null,null,null,null,null,null,"Fife"]
[null,null,null,null,null,null,null,"Glasgow City"]
[null,null,null,null,null,null,null,"Highland"]
[null,null,null,null,null,null,null,"Inverclyde"]
[null,null,null,null,null,null,null,"Midlothian"]
[null,null,null,null,null,null,null,"Moray"]
[null,null,null,null,null,null,null,"North Ayrshire"]
[null,null,null,null,null,null,null,"North Lanarkshire"]
[null,null,null,null,null,null,null,"Orkney Islands"]
[null,null,null,null,null,null,null,"Perth & Kinross"]
[null,null,null,null,null,null,null,"Renfrewshire"]
[null,null,null,null,null,null,null,"Scottish Borders"]
[null,null,null,null,null,null,null,"Shetland Islands"]
[null,null,null,null,null,null,null,"South Ayrshire"]
[null,null,null,null,null,null,null,"South Lanarkshire"]
[null,null,null,null,null,null,null,"Stirling"]
[null,null,null,null,null,null,null,"West Dunbartonshire"]
[null,null,null,null,null,null,null,"West Lothian"]
[null,null,null,null,null,null,null,"Scotland"]

{"sheet":"Data","index":5,"n_rows":3368,"n_cols":16,"rows_kept":3368,"cut":false,"hidden":true,"merged":[]}
[1,2,3,4,5,6,7,8,9,10,11,12,13,14,15,16]
[null,null,null,null,"Less than or equal to 2 days","More than 2 days and <= 2 weeks","More than 2 weeks and <= 4 weeks","More than 4 weeks and <= 6 weeks","More than 6 weeks","Total","Before care assessment completed","Less than or equal to 2 weeks","More than 2 weeks and <= 4 weeks","More than 4 weeks and <= 6 weeks","More than 6 weeks ","Total"]
[{"$f":"D3&B3&C3","v":"JantoMar11Aberdeen CityCritical"},"Aberdeen City","Critical","JantoMar11",0.63,0.31,0,0,0.06,1,0,0.67,0.13,7.0000000000000007E-2,0.13,1]
[{"$f":"D4&B4&C4","v":"JantoMar11Aberdeen CitySubstantial"},"Aberdeen City","Substantial","JantoMar11",0.19,0.31,0.38,0,0.13,1,0.08,0.67,0.08,0,0.17,1]
["JantoMar11Aberdeen CityModerate","Aberdeen City","Moderate","JantoMar11",0,0,0,0,0,0,0,0,0,0,0,0]
["JantoMar11Aberdeen CityLow or No Risk","Aberdeen City","Low or No Risk","JantoMar11",0,0,0,0,0,0,0,0,0,0,0,0]
["JantoMar11Aberdeen CityNot available","Aberdeen City","Not available","JantoMar11",0,0,0,0,0,0,0,0,0,0,0,0]
["JantoMar11Aberdeen CityTotals","Aberdeen City","Totals","JantoMar11",0.41,0.31,0.19,0,0.09,1,0.04,0.67,0.11,0.04,0.15,1]
["JantoMar11AberdeenshireCritical","Aberdeenshire","Critical","JantoMar11",0,0,0,0,0,0,0,0,0,0,0,0]
["JantoMar11AberdeenshireSubstantial","Aberdeenshire","Substantial","JantoMar11",0,0,0,0,0,0,0,0,0,0,0,0]
["JantoMar11AberdeenshireModerate","Aberdeenshire","Moderate","JantoMar11",0,0,0,0,0,0,0,0,0,0,0,0]
["JantoMar11AberdeenshireLow or No Risk","Aberdeenshire","Low or No Risk","JantoMar11",0,0,0,0,0,0,0,0,0,0,0,0]
["JantoMar11AberdeenshireNot available","Aberdeenshire","Not available","JantoMar11",0.1,0.46,0.22,0.05,0.17,1,0,0,0,0,0,0]
["JantoMar11AberdeenshireTotals","Aberdeenshire","Totals","JantoMar11",0.1,0.46,0.22,0.05,0.17,1,0,0,0,0,0,0]
["JantoMar11AngusCritical","Angus","Critical","JantoMar11",0.04,0.09,0.09,0.17,0.61,1,0.39,0.28000000000000003,0.11,0.17,0.06,1]
["JantoMar11AngusSubstantial","Angus","Substantial","JantoMar11",0.48,0.1,0.14000000000000001,7.0000000000000007E-2,0.21,1,0.18,0.82,0,0,0,1]
["JantoMar11AngusModerate","Angus","Moderate","JantoMar11",0.41,0.02,0.09,0.11,0.36,1,0.8,0.2,0,0,0,1]
["JantoMar11AngusLow or No Risk","Angus","Low or No Risk","JantoMar11",0.12,0.12,0.4,0.08,0.28000000000000003,1,0.25,0.75,0,0,0,1]
["JantoMar11AngusNot available","Angus","Not available","JantoMar11",0,0.25,0.5,0.25,0,1,0,0,1,0,0,1]
["JantoMar11AngusTotals","Angus","Totals","JantoMar11",0.3,0.08,0.17,0.11,0.33,1,0.32,0.54,0.06,0.06,0.02,1]
["JantoMar11Argyll & ButeCritical","Argyll & Bute","Critical","JantoMar11",0.22,0.37,0.19,0.06,0.16,1,0.35,0.41,0.04,0.04,0.15,1]
["JantoMar11Argyll & ButeSubstantial","Argyll & Bute","Substantial","JantoMar11",0.24,0.18,0.2,0.14000000000000001,0.25,1,0.34,0.36,0.11,0.05,0.14000000000000001,1]
["JantoMar11Argyll & ButeModerate","Argyll & Bute","Moderate","JantoMar11",0.2,0.2,7.0000000000000007E-2,0.2,0.33,1,0,0,0,0.33,0.67,1]
["JantoMar11Argyll & ButeLow or No Risk","Argyll & Bute","Low or No Risk","JantoMar11",0.6,0.2,0,0,0.2,1,0.5,0,0,0,0.5,1]
["JantoMar11Argyll & ButeNot available","Argyll & Bute","Not available","JantoMar11",0,0,0,0,0,0,0.5,0.5,0,0,0,1]
["JantoMar11Argyll & ButeTotals","Argyll & Bute","Totals","JantoMar11",0.24,0.24,0.18,0.12,0.22,1,0.35,0.37,7.0000000000000007E-2,0.05,0.15,1]
["JantoMar11ClackmannanshireCritical","Clackmannanshire","Critical","JantoMar11",0,0,0,0,0,0,0,0,0,0,0,0]
["JantoMar11ClackmannanshireSubstantial","Clackmannanshire","Substantial","JantoMar11",0.05,0.45,0.23,0.14000000000000001,0.14000000000000001,1,0,0,0,0,0,0]
["JantoMar11ClackmannanshireModerate","Clackmannanshire","Moderate","JantoMar11",0.03,0.2,0.14000000000000001,0.11,0.51,1,0,0,0,0,0,0]
["JantoMar11ClackmannanshireLow or No Risk","Clackmannanshire","Low or No Risk","JantoMar11",0,0.1,0.05,0.13,0.73,1,0,0,0,0,0,0]
["JantoMar11ClackmannanshireNot available","Clackmannanshire","Not available","JantoMar11",0,0,0,0,0,0,0.54,0.42,0.03,0.01,0,1]
["JantoMar11ClackmannanshireTotals","Clackmannanshire","Totals","JantoMar11",0.02,0.22,0.12,0.12,0.52,1,0.54,0.42,0.03,0.01,0,1]
["JantoMar11Dumfries and GallowayCritical","Dumfries and Galloway","Critical","JantoMar11",0,0,0,0,0,0,0,0,0,0,0,0]
["JantoMar11Dumfries and GallowaySubstantial","Dumfries and Galloway","Substantial","JantoMar11",0,0,0,0,0,0,0,0,0,0,0,0]
["JantoMar11Dumfries and GallowayModerate","Dumfries and Galloway","Moderate","JantoMar11",0,0,0,0,0,0,0,0,0,0,0,0]
["JantoMar11Dumfries and GallowayLow or No Risk","Dumfries and Galloway","Low or No Risk","JantoMar11",0,0,0,0,0,0,0,0,0,0,0,0]
["JantoMar11Dumfries and GallowayNot available","Dumfries and Galloway","Not available","JantoMar11",0.06,0.24,0.34,0.11,0.25,1,0,0.64,0.14000000000000001,0.08,0.14000000000000001,1]
["JantoMar11Dumfries and GallowayTotals","Dumfries and Galloway","Totals","JantoMar11",0.06,0.24,0.34,0.11,0.25,1,0,0.64,0.14000000000000001,0.08,0.14000000000000001,1]
["JantoMar11Dundee CityCritical","Dundee City","Critical","JantoMar11",0.23,0.45,0.15,0.13,0.05,1,0.22,0.57999999999999996,0.05,7.0000000000000007E-2,7.0000000000000007E-2,1]
["JantoMar11Dundee CitySubstantial","Dundee City","Substantial","JantoMar11",0.06,0.44,0.22,0.08,0.19,1,0.17,0.4,0.19,0.1,0.14000000000000001,1]
["JantoMar11Dundee CityModerate","Dundee City","Moderate","JantoMar11",0.09,0.28000000000000003,0.15,0.09,0.38,1,0.39,0.31,0.19,0.04,7.0000000000000007E-2,1]
["JantoMar11Dundee CityLow or No Risk","Dundee City","Low or No Risk","JantoMar11",0.11,0.23,0.2,0.14000000000000001,0.33,1,0.24,0.41,0.18,0,0.18,1]
["JantoMar11Dundee CityNot available","Dundee City","Not available","JantoMar11",0.15,0.23,0.31,0,0.31,1,0.23,0.45,0.14000000000000001,0.09,0.09,1]
["JantoMar11Dundee CityTotals","Dundee City","Totals","JantoMar11",0.11,0.32,0.18,0.1,0.28999999999999998,1,0.26,0.41,0.16,7.0000000000000007E-2,0.1,1]
["JantoMar11East AyrshireCritical","East Ayrshire","Critical","JantoMar11",0.49,0.27,0.22,0,0.02,1,0.48,0.28000000000000003,0.21,0.03,0,1]
["JantoMar11East AyrshireSubstantial","East Ayrshire","Substantial","JantoMar11",0.63,0.28999999999999998,0.04,0,0.04,1,0.64,0.21,0.14000000000000001,0,0,1]
["JantoMar11East AyrshireModerate","East Ayrshire","Moderate","JantoMar11",0.63,0.23,0.05,0.05,0.05,1,0.59,0.28999999999999998,0.12,0,0,1]
["JantoMar11East AyrshireLow or No Risk","East Ayrshire","Low or No Risk","JantoMar11",0,0,0,0,0,0,0,0,0,0,0,0]
["JantoMar11East AyrshireNot available","East Ayrshire","Not available","JantoMar11",0.74,0.26,0,0,0,1,0.53,0.32,0.05,0.05,0.05,1]
["JantoMar11East AyrshireTotals","East Ayrshire","Totals","JantoMar11",0.59,0.26,0.1,0.02,0.03,1,0.54,0.28000000000000003,0.14000000000000001,0.03,0.01,1]
["JantoMar11East DunbartonshireCritical","East Dunbartonshire","Critical","JantoMar11",0.33,0.17,0.17,0.17,0.17,1,0,1,0,0,0,1]
["JantoMar11East DunbartonshireSubstantial","East Dunbartonshire","Substantial","JantoMar11",0.57999999999999996,0.21,0.09,0.05,7.0000000000000007E-2,1,0,0.98,0.01,0.01,0.01,1]
["JantoMar11East DunbartonshireModerate","East Dunbartonshire","Moderate","JantoMar11",0.19,0.2,0.13,0.03,0.45,1,0,0.89,0.06,0.06,0,1]
["JantoMar11East DunbartonshireLow or No Risk","East Dunbartonshire","Low or No Risk","JantoMar11",0.09,0.19,0.09,0.03,0.59,1,0,1,0,0,0,1]
["JantoMar11East DunbartonshireNot available","East Dunbartonshire","Not available","JantoMar11",0.33,0.33,0.11,0,0.22,1,0,0.75,0.25,0,0,1]
["JantoMar11East DunbartonshireTotals","East Dunbartonshire","Totals","JantoMar11",0.44,0.21,0.1,0.04,0.2,1,0,0.97,0.02,0.01,0,1]
["JantoMar11East LothianCritical","East Lothian","Critical","JantoMar11",0.33,0.2,0.19,0.11,0.17,1,0.41,0.46,0.08,0.03,0.02,1]
["JantoMar11East LothianSubstantial","East Lothian","Substantial","JantoMar11",0.35,0.17,0.22,0.13,0.13,1,0,0,0,0,0,0]
["JantoMar11East LothianModerate","East Lothian","Moderate","JantoMar11",0,0,0,0,0,0,0,0,0,0,0,0]
["JantoMar11East LothianLow or No Risk","East Lothian","Low or No Risk","JantoMar11",0,0,0,0,0,0,0,0,0,0,0,0]
["JantoMar11East LothianNot available","East Lothian","Not available","JantoMar11",0,0,0,0,0,0,0,0,0,0,0,0]
["JantoMar11East LothianTotals","East Lothian","Totals","JantoMar11",0.33,0.2,0.19,0.11,0.16,1,0.41,0.46,0.08,0.03,0.02,1]
["JantoMar11East RenfrewshireCritical","East Renfrewshire","Critical","JantoMar11",0.11,0.18,0.48,0.11,0.12,1,0.01,0.84,0.1,0.05,0,1]
["JantoMar11East RenfrewshireSubstantial","East Renfrewshire","Substantial","JantoMar11",0.02,0.13,0.65,0.04,0.16,1,0.05,0.95,0,0,0,1]
["JantoMar11East RenfrewshireModerate","East Renfrewshire","Moderate","JantoMar11",0.1,0.2,0.6,0,0.1,1,0,0.93,0.04,0.04,0,1]
["JantoMar11East RenfrewshireLow or No Risk","East Renfrewshire","Low or No Risk","JantoMar11",0,0,0,0,0,0,0,0,0,0,0,0]
["JantoMar11East RenfrewshireNot available","East Renfrewshire","Not available","JantoMar11",0.17,0.11,0.61,0.06,0.06,1,0,0.78,0.11,0.11,0,1]
[{"$f":"D68&B68&C68","v":"JantoMar11East RenfrewshireTotals"},"East Renfrewshire","Totals","JantoMar11",0.08,0.16,0.56999999999999995,7.0000000000000007E-2,0.13,1,0.01,0.87,7.0000000000000007E-2,0.05,0,1]
["JantoMar11Edinburgh, City ofCritical","Edinburgh, City of","Critical","JantoMar11",0,0,0,0,0,0,0,0,0,0,0,0]
["JantoMar11Edinburgh, City ofSubstantial","Edinburgh, City of","Substantial","JantoMar11",0,0,0,0,0,0,0,0,0,0,0,0]
["JantoMar11Edinburgh, City ofModerate","Edinburgh, City of","Moderate","JantoMar11",0,0,0,0,0,0,0,0,0,0,0,0]
["JantoMar11Edinburgh, City ofLow or No Risk","Edinburgh, City of","Low or No Risk","JantoMar11",0,0,0,0,0,0,0,0,0,0,0,0]
["JantoMar11Edinburgh, City ofNot available","Edinburgh, City of","Not available","JantoMar11",0.14000000000000001,0.25,0.28999999999999998,0.17,0.16,1,0.12,0.66,0.12,0.06,0.05,1]
["JantoMar11Edinburgh, City ofTotals","Edinburgh, City of","Totals","JantoMar11",0.14000000000000001,0.25,0.28999999999999998,0.17,0.16,1,0.12,0.66,0.12,0.06,0.05,1]
["JantoMar11Eilean SiarCritical","Eilean Siar","Critical","JantoMar11",0,0,0,0,0,0,0,0,0,0,0,0]
["JantoMar11Eilean SiarSubstantial","Eilean Siar","Substantial","JantoMar11",0.33,0.22,0.33,0,0.11,1,0,0.5,0.33,0,0.17,1]
["JantoMar11Eilean SiarModerate","Eilean Siar","Moderate","JantoMar11",0.17,0.5,0,0,0.33,1,0,1,0,0,0,1]
["JantoMar11Eilean SiarLow or No Risk","Eilean Siar","Low or No Risk","JantoMar11",0,0.5,0.5,0,0,1,0.5,0.5,0,0,0,1]
["JantoMar11Eilean SiarNot available","Eilean Siar","Not available","JantoMar11",0.37,0.37,0.05,0.05,0.16,1,0.08,0.57999999999999996,0.25,0,0.08,1]
["JantoMar11Eilean SiarTotals","Eilean Siar","Totals","JantoMar11",0.31,0.36,0.14000000000000001,0.03,0.17,1,0.08,0.65,0.19,0,0.08,1]
["JantoMar11FalkirkCritical","Falkirk","Critical","JantoMar11",0,0,0,0,0,0,0,0,0,0,0,0]
["JantoMar11FalkirkSubstantial","Falkirk","Substantial","JantoMar11",0,0,0,0,0,0,0,0,0,0,0,0]
["JantoMar11FalkirkModerate","Falkirk","Moderate","JantoMar11",0,0,0,0,0,0,0,0,0,0,0,0]
["JantoMar11FalkirkLow or No Risk","Falkirk","Low or No Risk","JantoMar11",0,0,0,0,0,0,0,0,0,0,0,0]
["JantoMar11FalkirkNot available","Falkirk","Not available","JantoMar11",0,0,0,0,0,0,0,0,0,0,0,0]
["JantoMar11FalkirkTotals","Falkirk","Totals","JantoMar11",0,0,0,0,0,0,0,0,0,0,0,0]
["JantoMar11FifeCritical","Fife","Critical","JantoMar11",0.3,0.42,0.13,0.09,0.06,1,0.03,0.62,0.11,0,0.24,1]
["JantoMar11FifeSubstantial","Fife","Substantial","JantoMar11",0.08,0.24,0.23,0.13,0.33,1,0.04,0.75,0.12,0.09,0,1]
["JantoMar11FifeModerate","Fife","Moderate","JantoMar11",0.06,0.22,0.18,0.1,0.43,1,0,0.5,0.25,0.25,0,1]
["JantoMar11FifeLow or No Risk","Fife","Low or No Risk","JantoMar11",0,0,0.28999999999999998,0.71,0,1,0,0,0,0,0,0]
["JantoMar11FifeNot available","Fife","Not available","JantoMar11",0.14000000000000001,0.28000000000000003,0.2,0.14000000000000001,0.24,1,0.06,0.44,0.17,0.11,0.22,1]
["JantoMar11FifeTotals","Fife","Totals","JantoMar11",0.11,0.26,0.21,0.13,0.3,1,0.04,0.69,0.13,0.08,0.06,1]
["JantoMar11Glasgow CityCritical","Glasgow City","Critical","JantoMar11",0.04,0.26,0.19,0.11,0.41,1,0,1,0,0,0,1]
["JantoMar11Glasgow CitySubstantial","Glasgow City","Substantial","JantoMar11",7.0000000000000007E-2,0.12,0.11,0.09,0.62,1,0,1,0,0,0,1]
["JantoMar11Glasgow CityModerate","Glasgow City","Moderate","JantoMar11",0.12,0.13,7.0000000000000007E-2,0.05,0.62,1,0,1,0,0,0,1]
["JantoMar11Glasgow CityLow or No Risk","Glasgow City","Low or No Risk","JantoMar11",0.21,0.1,0.17,0,0.52,1,0,1,0,0,0,1]
["JantoMar11Glasgow CityNot available","Glasgow City","Not available","JantoMar11",0.23,0.15,0.15,0.05,0.42,1,0,1,0,0,0,1]
["JantoMar11Glasgow CityTotals","Glasgow City","Totals","JantoMar11",0.12,0.14000000000000001,0.11,7.0000000000000007E-2,0.56999999999999995,1,0,1,0,0,0,1]
["JantoMar11HighlandCritical","Highland","Critical","JantoMar11",0.06,0.28000000000000003,0.28999999999999998,0.13,0.24,1,0,0,0,0,0,0]
["JantoMar11HighlandSubstantial","Highland","Substantial","JantoMar11",0.09,0.21,0.15,0.11,0.45,1,0,0,0,0,0,0]
["JantoMar11HighlandModerate","Highland","Moderate","JantoMar11",0.09,0.17,0.19,0.1,0.44,1,0,0,0,0,0,0]
["JantoMar11HighlandLow or No Risk","Highland","Low or No Risk","JantoMar11",0.06,0.13,0.44,0.06,0.31,1,0,0,0,0,0,0]
["JantoMar11HighlandNot available","Highland","Not available","JantoMar11",0.17,0.2,0.19,0.12,0.32,1,0,0,0,0,0,0]
["JantoMar11HighlandTotals","Highland","Totals","JantoMar11",0.09,0.22,0.22,0.11,0.37,1,0,0,0,0,0,0]
["JantoMar11InverclydeCritical","Inverclyde","Critical","JantoMar11",0,0,0,0,0,0,0,0,0,0,0,0]
["JantoMar11InverclydeSubstantial","Inverclyde","Substantial","JantoMar11",0,0,0,0,0,0,0,0,0,0,0,0]
["JantoMar11InverclydeModerate","Inverclyde","Moderate","JantoMar11",0,0,0,0,0,0,0,0,0,0,0,0]
["JantoMar11InverclydeLow or No Risk","Inverclyde","Low or No Risk","JantoMar11",0,0,0,0,0,0,0,0,0,0,0,0]
["JantoMar11InverclydeNot available","Inverclyde","Not available","JantoMar11",0,0,0,0,0,0,0,0,0,0,0,0]
["JantoMar11InverclydeTotals","Inverclyde","Totals","JantoMar11",0,0,0,0,0,0,0,0,0,0,0,0]
["JantoMar11MidlothianCritical","Midlothian","Critical","JantoMar11",0,0,0,0,0,0,0,0,0,0,0,0]
["JantoMar11MidlothianSubstantial","Midlothian","Substantial","JantoMar11",0,0,0,0,0,0,0,0,0,0,0,0]
["JantoMar11MidlothianModerate","Midlothian","Moderate","JantoMar11",0,0,0,0,0,0,0,0,0,0,0,0]
["JantoMar11MidlothianLow or No Risk","Midlothian","Low or No Risk","JantoMar11",0,0,0,0,0,0,0,0,0,0,0,0]
["JantoMar11MidlothianNot available","Midlothian","Not available","JantoMar11",0.01,0.21,0.28000000000000003,0.16,0.34,1,0,0,0,0,0,0]
["JantoMar11MidlothianTotals","Midlothian","Totals","JantoMar11",0.01,0.21,0.28000000000000003,0.16,0.34,1,0,0,0,0,0,0]
["JantoMar11MorayCritical","Moray","Critical","JantoMar11",0.11,0.56000000000000005,0.33,0,0,1,0.12,0.82,0,0.06,0,1]
["JantoMar11MoraySubstantial","Moray","Substantial","JantoMar11",0.24,0.48,0.27,0,0,1,0.18,0.71,0.09,0.02,0,1]
["JantoMar11MorayModerate","Moray","Moderate","JantoMar11",0.67,0.33,0,0,0,1,0,0.5,0,0.5,0,1]
["JantoMar11MorayLow or No Risk","Moray","Low or No Risk","JantoMar11",0,0,0,0,0,0,0,0,0,0,0,0]
["JantoMar11MorayNot available","Moray","Not available","JantoMar11",0.22,0.56000000000000005,0.19,0,0.04,1,0.13,0.82,0.05,0,0,1]
["JantoMar11MorayTotals","Moray","Totals","JantoMar11",0.24,0.51,0.24,0,0.01,1,0.15,0.76,0.06,0.03,0,1]
["JantoMar11North AyrshireCritical","North Ayrshire","Critical","JantoMar11",0.13,0.17,0.17,0.04,0.5,1,0.44,0.56000000000000005,0,0,0,1]
["JantoMar11North AyrshireSubstantial","North Ayrshire","Substantial","JantoMar11",0.11,0.23,0.23,0.14000000000000001,0.28999999999999998,1,0.41,0.52,0.05,0.02,0,1]
["JantoMar11North AyrshireModerate","North Ayrshire","Moderate","JantoMar11",0.25,0.08,0.17,0.25,0.25,1,0.5,0.33,0.17,0,0,1]
["JantoMar11North AyrshireLow or No Risk","North Ayrshire","Low or No Risk","JantoMar11",0.11,0.33,0.11,0,0.44,1,0,0,0,0,0,0]
["JantoMar11North AyrshireNot available","North Ayrshire","Not available","JantoMar11",0,0,0.5,0,0.5,1,0,0,0,0,0,0]
["JantoMar11North AyrshireTotals","North Ayrshire","Totals","JantoMar11",0.13,0.19,0.2,0.11,0.37,1,0.43,0.52,0.04,0.01,0,1]
["JantoMar11North LanarkshireCritical","North Lanarkshire","Critical","JantoMar11",0.61,0.22,7.0000000000000007E-2,0.03,7.0000000000000007E-2,1,0.28999999999999998,0.63,0.05,0.02,0.02,1]
["JantoMar11North LanarkshireSubstantial","North Lanarkshire","Substantial","JantoMar11",0.47,0.3,0.09,0.05,0.1,1,0.28000000000000003,0.59,0.06,0.04,0.03,1]
["JantoMar11North LanarkshireModerate","North Lanarkshire","Moderate","JantoMar11",0.52,0.27,0.06,0.03,0.11,1,0.33,0.61,0.02,0.04,0,1]
[{"$f":"D132&B132&C132","v":"JantoMar11North LanarkshireLow or No Risk"},"North Lanarkshire","Low or No Risk","JantoMar11",0.56999999999999995,0.26,0.05,0.04,7.0000000000000007E-2,1,0.35,0.52,0,0.04,0.09,1]
["JantoMar11North LanarkshireNot available","North Lanarkshire","Not available","JantoMar11",0.43,0.14000000000000001,0.1,0,0.33,1,1,0,0,0,0,1]
["JantoMar11North LanarkshireTotals","North Lanarkshire","Totals","JantoMar11",0.55000000000000004,0.25,7.0000000000000007E-2,0.04,0.09,1,0.3,0.6,0.04,0.03,0.02,1]
["JantoMar11Orkney islandsCritical","Orkney islands","Critical","JantoMar11",0,0,0,0,0,0,0,0,0,0,0,0]
["JantoMar11Orkney islandsSubstantial","Orkney islands","Substantial","JantoMar11",0,0,0,0,0,0,0,0,0,0,0,0]
["JantoMar11Orkney islandsModerate","Orkney islands","Moderate","JantoMar11",0,0,0,0,0,0,0,0,0,0,0,0]
["JantoMar11Orkney islandsLow or No Risk","Orkney islands","Low or No Risk","JantoMar11",0,0,0,0,0,0,0,0,0,0,0,0]
["JantoMar11Orkney islandsNot available","Orkney islands","Not available","JantoMar11",0,0,0,0,0,0,0,0,0,0,0,0]
["JantoMar11Orkney islandsTotals","Orkney islands","Totals","JantoMar11",0,0,0,0,0,0,0,0,0,0,0,0]
["JantoMar11Perth & KinrossCritical","Perth & Kinross","Critical","JantoMar11",0,0,0,0,0,0,0,0.67,0,0,0.33,1]
["JantoMar11Perth & KinrossSubstantial","Perth & Kinross","Substantial","JantoMar11",0.06,0.32,0.12,0.09,0.41,1,0,0.67,0,0,0.33,1]
["JantoMar11Perth & KinrossModerate","Perth & Kinross","Moderate","JantoMar11",0.15,0.27,0.21,0.11,0.26,1,0.1,0.1,0.1,0.3,0.4,1]
["JantoMar11Perth & KinrossLow or No Risk","Perth & Kinross","Low or No Risk","JantoMar11",0.12,0.36,0.08,0.04,0.4,1,0,1,0,0,0,1]
["JantoMar11Perth & KinrossNot available","Perth & Kinross","Not available","JantoMar11",0.62,0,0.12,0.08,0.19,1,0,0,0,0,1,1]
["JantoMar11Perth & KinrossTotals","Perth & Kinross","Totals","JantoMar11",0.2,0.25,0.16,0.09,0.3,1,0.04,0.25,0.04,0.13,0.54,1]
["JantoMar11RenfrewshireCritical","Renfrewshire","Critical","JantoMar11",0.82,0,0,0.09,0.09,1,0.74,0.06,0.1,0.03,0.06,1]
["JantoMar11RenfrewshireSubstantial","Renfrewshire","Substantial","JantoMar11",0.52,0.04,0.15,7.0000000000000007E-2,0.22,1,0.83,0.03,0.11,0.03,0,1]
["JantoMar11RenfrewshireModerate","Renfrewshire","Moderate","JantoMar11",0,0.5,0,0,0.5,1,1,0,0,0,0,1]
["JantoMar11RenfrewshireLow or No Risk","Renfrewshire","Low or No Risk","JantoMar11",1,0,0,0,0,1,0,0,0,0,1,1]
["JantoMar11RenfrewshireNot available","Renfrewshire","Not available","JantoMar11",0.31,0.15,0.1,0.15,0.3,1,0.54,0.19,0.14000000000000001,0.08,0.05,1]
["JantoMar11RenfrewshireTotals","Renfrewshire","Totals","JantoMar11",0.35,0.13,0.1,0.13,0.28000000000000003,1,0.7,0.09,0.11,0.05,0.05,1]
["JantoMar11Scottish BordersCritical","Scottish Borders","Critical","JantoMar11",0,0,0,0,0,0,0,0,0,0,0,0]
["JantoMar11Scottish BordersSubstantial","Scottish Borders","Substantial","JantoMar11",0,0,0,0,0,0,0,0,0,0,0,0]
["JantoMar11Scottish BordersModerate","Scottish Borders","Moderate","JantoMar11",0,0,0,0,0,0,0,0,0,0,0,0]
["JantoMar11Scottish BordersLow or No Risk","Scottish Borders","Low or No Risk","JantoMar11",0,0,0,0,0,0,0,0,0,0,0,0]
["JantoMar11Scottish BordersNot available","Scottish Borders","Not available","JantoMar11",0,0,0,0,0,0,0,0,0,0,0,0]
["JantoMar11Scottish BordersTotals","Scottish Borders","Totals","JantoMar11",0,0,0,0,0,0,0,0,0,0,0,0]
["JantoMar11Shetland islandsCritical","Shetland islands","Critical","JantoMar11",0.17,0.42,0.08,0,0.33,1,0,0,1,0,0,1]
["JantoMar11Shetland islandsSubstantial","Shetland islands","Substantial","JantoMar11",0.17,0.42,0,0.17,0.25,1,0.43,0.56999999999999995,0,0,0,1]
["JantoMar11Shetland islandsModerate","Shetland islands","Moderate","JantoMar11",0.14000000000000001,0.14000000000000001,0.28999999999999998,0,0.43,1,0,0.5,0.5,0,0,1]
["JantoMar11Shetland islandsLow or No Risk","Shetland islands","Low or No Risk","JantoMar11",0,0,0.75,0,0.25,1,0,0,0,0,0,0]
["JantoMar11Shetland islandsNot available","Shetland islands","Not available","JantoMar11",0.17,0.4,0.12,0.09,0.22,1,0.08,0.72,0.17,0.03,0,1]
["JantoMar11Shetland islandsTotals","Shetland islands","Totals","JantoMar11",0.16,0.37,0.14000000000000001,0.08,0.25,1,0.13,0.67,0.17,0.02,0,1]
["JantoMar11South AyrshireCritical","South Ayrshire","Critical","JantoMar11",0,0,0,0,0,0,0,0,0,0,0,0]
["JantoMar11South AyrshireSubstantial","South Ayrshire","Substantial","JantoMar11",0,0,0,0,0,0,0,0,0,0,0,0]
["JantoMar11South AyrshireModerate","South Ayrshire","Moderate","JantoMar11",0,0,0,0,0,0,0,0,0,0,0,0]
["JantoMar11South AyrshireLow or No Risk","South Ayrshire","Low or No Risk","JantoMar11",0,0,0,0,0,0,0,0,0,0,0,0]
["JantoMar11South AyrshireNot available","South Ayrshire","Not available","JantoMar11",0,0,0,0,0,0,0,0,0,0,0,0]
["JantoMar11South AyrshireTotals","South Ayrshire","Totals","JantoMar11",0,0,0,0,0,0,0,0,0,0,0,0]
["JantoMar11South LanarkshireCritical","South Lanarkshire","Critical","JantoMar11",0,0,0,0,0,0,0,0,0,0,0,0]
["JantoMar11South LanarkshireSubstantial","South Lanarkshire","Substantial","JantoMar11",0,0,0,0,0,0,0,0,0,0,0,0]
["JantoMar11South LanarkshireModerate","South Lanarkshire","Moderate","JantoMar11",0,0,0,0,0,0,0,0,0,0,0,0]
["JantoMar11South LanarkshireLow or No Risk","South Lanarkshire","Low or No Risk","JantoMar11",0,0,0,0,0,0,0,0,0,0,0,0]
["JantoMar11South LanarkshireNot available","South Lanarkshire","Not available","JantoMar11",0,0,0,0,0,0,0,0,0,0,0,0]
["JantoMar11South LanarkshireTotals","South Lanarkshire","Totals","JantoMar11",0,0,0,0,0,0,0,0,0,0,0,0]
["JantoMar11StirlingCritical","Stirling","Critical","JantoMar11",0.78,0.11,0.04,0,7.0000000000000007E-2,1,0.04,0.92,0,0,0.04,1]
["JantoMar11StirlingSubstantial","Stirling","Substantial","JantoMar11",0.54,0.16,0.01,0.08,0.21,1,7.0000000000000007E-2,0.2,0.47,0.2,7.0000000000000007E-2,1]
["JantoMar11StirlingModerate","Stirling","Moderate","JantoMar11",0.12,0.04,0,0.04,0.81,1,1,0,0,0,0,1]
["JantoMar11StirlingLow or No Risk","Stirling","Low or No Risk","JantoMar11",0,0,0,0,0,0,0,0,0,0,0,0]
["JantoMar11StirlingNot available","Stirling","Not available","JantoMar11",0.31,0.31,0.12,0,0.26,1,0.06,0.63,0.13,0.06,0.13,1]
["JantoMar11StirlingTotals","Stirling","Totals","JantoMar11",0.49,0.16,0.04,0.04,0.27,1,0.09,0.61,0.16,7.0000000000000007E-2,7.0000000000000007E-2,1]
["JantoMar11West DunbartonshireCritical","West Dunbartonshire","Critical","JantoMar11",0.95,0,0.05,0,0,1,1,0,0,0,0,1]
["JantoMar11West DunbartonshireSubstantial","West Dunbartonshire","Substantial","JantoMar11",0.24,0.63,0.11,0.01,0.01,1,0,1,0,0,0,1]
["JantoMar11West DunbartonshireModerate","West Dunbartonshire","Moderate","JantoMar11",0,0,0.31,0.5,0.19,1,0,0,1,0,0,1]
["JantoMar11West DunbartonshireLow or No Risk","West Dunbartonshire","Low or No Risk","JantoMar11",0,0,0.05,0.03,0.92,1,0,0,1,0,0,1]
["JantoMar11West DunbartonshireNot available","West Dunbartonshire","Not available","JantoMar11",0,0,0,0,0,0,0,0,0,0,0,0]
["JantoMar11West DunbartonshireTotals","West Dunbartonshire","Totals","JantoMar11",0.24,0.21,0.12,0.12,0.3,1,0.74,0.19,7.0000000000000007E-2,0,0,1]
["JantoMar11West LothianCritical","West Lothian","Critical","JantoMar11",0.23,0.21,0.33,0.05,0.18,1,0.31,0.5,7.0000000000000007E-2,0.1,0.01,1]
["JantoMar11West LothianSubstantial","West Lothian","Substantial","JantoMar11",0.05,0.23,0.14000000000000001,0.17,0.41,1,0.5,0.28000000000000003,0.05,0.03,0.15,1]
["JantoMar11West LothianModerate","West Lothian","Moderate","JantoMar11",0.32,0.06,0.13,0.1,0.39,1,0.38,0.44,0.15,0.03,0,1]
["JantoMar11West LothianLow or No Risk","West Lothian","Low or No Risk","JantoMar11",0.43,7.0000000000000007E-2,0,7.0000000000000007E-2,0.43,1,0.22,0.44,0.11,0,0.22,1]
["JantoMar11West LothianNot available","West Lothian","Not available","JantoMar11",0.3,0.05,0.05,0.3,0.3,1,0,0,0,0,1,1]
["JantoMar11West LothianTotals","West Lothian","Totals","JantoMar11",0.2,0.16,0.16,0.14000000000000001,0.34,1,0.37,0.42,0.08,0.06,7.0000000000000007E-2,1]
["JantoMar11SCOTLAND TOTALSCritical","SCOTLAND TOTALS","Critical","JantoMar11",0.35,0.24,0.18,7.0000000000000007E-2,0.16,1,0.33,0.53,7.0000000000000007E-2,0.04,0.04,1]
[{"$f":"D196&B196&C196","v":"JantoMar11SCOTLAND TOTALSSubstantial"},"SCOTLAND TOTALS","Substantial","JantoMar11",0.22,0.23,0.16,0.09,0.3,1,0.14000000000000001,0.73,0.06,0.03,0.03,1]
["JantoMar11SCOTLAND TOTALSModerate","SCOTLAND TOTALS","Moderate","JantoMar11",0.19,0.18,0.13,0.09,0.4,1,0.17,0.71,7.0000000000000007E-2,0.03,0.02,1]
["JantoMar11SCOTLAND TOTALSLow or No Risk","SCOTLAND TOTALS","Low or No Risk","JantoMar11",0.23,0.17,0.13,7.0000000000000007E-2,0.4,1,0.22,0.59,0.06,0.01,0.11,1]
["JantoMar11SCOTLAND TOTALSNot available","SCOTLAND TOTALS","Not available","JantoMar11",0.16,0.25,0.24,0.13,0.21,1,0.12,0.65,0.11,0.05,7.0000000000000007E-2,1]
["JantoMar11SCOTLAND TOTALSTotals","SCOTLAND TOTALS","Totals","JantoMar11",0.21,0.23,0.19,0.1,0.27,1,0.18,0.65,0.08,0.04,0.05,1]
["AprtoJun11Aberdeen CityCritical","Aberdeen City","Critical","AprtoJun11",0,0.22,0.56000000000000005,0.22,0,1,0.25,0.63,0,0.13,0,1]
["AprtoJun11Aberdeen CitySubstantial","Aberdeen City","Substantial","AprtoJun11",0.24,0.36,0.24,7.0000000000000007E-2,0.09,1,0.28000000000000003,0.34,0.22,0.16,0,1]
["AprtoJun11Aberdeen CityModerate","Aberdeen City","Moderate","AprtoJun11",0.14000000000000001,0.56999999999999995,0,0.28999999999999998,0,1,0,0,0,0,0,0]
["AprtoJun11Aberdeen CityLow or No Risk","Aberdeen City","Low or No Risk","AprtoJun11",0,0,0,0,0,0,0,0,0,0,0,0]
["AprtoJun11Aberdeen CityNot available","Aberdeen City","Not available","AprtoJun11",0,0,0,0,0,0,0,0,0,0,0,0]
["AprtoJun11Aberdeen CityTotals","Aberdeen City","Totals","AprtoJun11",0.2,0.36,0.26,0.11,7.0000000000000007E-2,1,0.28000000000000003,0.4,0.18,0.15,0,1]
["AprtoJun11AberdeenshireCritical","Aberdeenshire","Critical","AprtoJun11",0,0,0,1,0,1,0,0,0,0,0,0]
["AprtoJun11AberdeenshireSubstantial","Aberdeenshire","Substantial","AprtoJun11",0,0.33,0.17,0.17,0.33,1,0,0,0,0,0,0]
["AprtoJun11AberdeenshireModerate","Aberdeenshire","Moderate","AprtoJun11",0.25,0.17,0.33,0.08,0.17,1,0,0,0,0,0,0]
["AprtoJun11AberdeenshireLow or No Risk","Aberdeenshire","Low or No Risk","AprtoJun11",0,0.5,0.1,0.1,0.3,1,0,0,0,0,0,0]
["AprtoJun11AberdeenshireNot available","Aberdeenshire","Not available","AprtoJun11",0.1,0.28999999999999998,0.2,0.11,0.3,1,0,0,0,0,0,0]
["AprtoJun11AberdeenshireTotals","Aberdeenshire","Totals","AprtoJun11",0.09,0.3,0.2,0.12,0.28999999999999998,1,0,0,0,0,0,0]
["AprtoJun11AngusCritical","Angus","Critical","AprtoJun11",0.08,0.15,0.08,0.08,0.62,1,0.22,0.32,0.3,0.08,0.08,1]
["AprtoJun11AngusSubstantial","Angus","Substantial","AprtoJun11",0.45,0.13,0.11,0,0.32,1,0.04,0.93,0.01,0.01,0,1]
["AprtoJun11AngusModerate","Angus","Moderate","AprtoJun11",0.35,0.1,0.05,0.15,0.35,1,0.04,0.93,0,0.04,0,1]
["AprtoJun11AngusLow or No Risk","Angus","Low or No Risk","AprtoJun11",0.33,0.1,0.38,0.1,0.1,1,0.09,0.89,0.03,0,0,1]
["AprtoJun11AngusNot available","Angus","Not available","AprtoJun11",0,0.32,0.26,0.11,0.32,1,0.5,0.5,0,0,0,1]
["AprtoJun11AngusTotals","Angus","Totals","AprtoJun11",0.28000000000000003,0.15,0.15,0.08,0.35,1,0.1,0.78,0.08,0.03,0.02,1]
["AprtoJun11Argyll & ButeCritical","Argyll & Bute","Critical","AprtoJun11",0.08,0.27,0.3,0.2,0.15,1,0.39,0.21,0.18,0.06,0.15,1]
["AprtoJun11Argyll & ButeSubstantial","Argyll & Bute","Substantial","AprtoJun11",0.14000000000000001,0.33,0.18,0.14000000000000001,0.21,1,0.31,0.25,0.1,0.15,0.19,1]
["AprtoJun11Argyll & ButeModerate","Argyll & Bute","Moderate","AprtoJun11",0,0.25,0.25,0.25,0.25,1,0.4,0.2,0.4,0,0,1]
["AprtoJun11Argyll & ButeLow or No Risk","Argyll & Bute","Low or No Risk","AprtoJun11",0.17,0.17,0.17,0.17,0.33,1,0,0.75,0,0,0.25,1]
["AprtoJun11Argyll & ButeNot available","Argyll & Bute","Not available","AprtoJun11",0,0,0,0,0,0,0,0,0,0,0,0]
["AprtoJun11Argyll & ButeTotals","Argyll & Bute","Totals","AprtoJun11",0.12,0.3,0.22,0.17,0.19,1,0.33,0.26,0.14000000000000001,0.11,0.17,1]
["AprtoJun11ClackmannanshireCritical","Clackmannanshire","Critical","AprtoJun11",0,0,0,0,0,0,0,0,0,0,0,0]
["AprtoJun11ClackmannanshireSubstantial","Clackmannanshire","Substantial","AprtoJun11",0,0.79,0,0,0.21,1,0,0,0,0,0,0]
["AprtoJun11ClackmannanshireModerate","Clackmannanshire","Moderate","AprtoJun11",0,0.33,0.13,0,0.53,1,0,0,0,0,0,0]
["AprtoJun11ClackmannanshireLow or No Risk","Clackmannanshire","Low or No Risk","AprtoJun11",0,0.06,0.13,0.04,0.77,1,0,0,0,0,0,0]
["AprtoJun11ClackmannanshireNot available","Clackmannanshire","Not available","AprtoJun11",0,0,0,0,0,0,0.7,0.27,0.01,0.02,0,1]
["AprtoJun11ClackmannanshireTotals","Clackmannanshire","Totals","AprtoJun11",0,0.25,0.1,0.03,0.62,1,0.7,0.27,0.01,0.02,0,1]
["AprtoJun11Dumfries and GallowayCritical","Dumfries and Galloway","Critical","AprtoJun11",0,0,0,0,0,0,0,0,0,0,0,0]
["AprtoJun11Dumfries and GallowaySubstantial","Dumfries and Galloway","Substantial","AprtoJun11",0,0,0,0,0,0,0,0,0,0,0,0]
["AprtoJun11Dumfries and GallowayModerate","Dumfries and Galloway","Moderate","AprtoJun11",0,0,0,0,0,0,0,0,0,0,0,0]
["AprtoJun11Dumfries and GallowayLow or No Risk","Dumfries and Galloway","Low or No Risk","AprtoJun11",0,0,0,0,0,0,0,0,0,0,0,0]
["AprtoJun11Dumfries and GallowayNot available","Dumfries and Galloway","Not available","AprtoJun11",0.5,0.4,0.04,0.01,0.04,1,0.1,0.65,0.12,7.0000000000000007E-2,0.06,1]
["AprtoJun11Dumfries and GallowayTotals","Dumfries and Galloway","Totals","AprtoJun11",0.5,0.4,0.04,0.01,0.04,1,0.1,0.65,0.12,7.0000000000000007E-2,0.06,1]
["AprtoJun11Dundee CityCritical","Dundee City","Critical","AprtoJun11",0.18,0.32,0.14000000000000001,0.11,0.25,1,0.67,0.14000000000000001,0.19,0,0,1]
["AprtoJun11Dundee CitySubstantial","Dundee City","Substantial","AprtoJun11",0.12,0.31,0.15,0.04,0.38,1,0.51,0.37,0.05,7.0000000000000007E-2,0,1]
["AprtoJun11Dundee CityModerate","Dundee City","Moderate","AprtoJun11",7.0000000000000007E-2,0.2,0.06,0.13,0.54,1,0.59,0.27,7.0000000000000007E-2,0.02,0.04,1]
["AprtoJun11Dundee CityLow or No Risk","Dundee City","Low or No Risk","AprtoJun11",0.24,0.26,0.04,0.04,0.41,1,0.4,0.33,0.13,7.0000000000000007E-2,7.0000000000000007E-2,1]
["AprtoJun11Dundee CityNot available","Dundee City","Not available","AprtoJun11",0.2,0,0,0,0.8,1,0.87,0.02,0,0,0.11,1]
["AprtoJun11Dundee CityTotals","Dundee City","Totals","AprtoJun11",0.13,0.24,0.09,0.09,0.46,1,0.65,0.21,0.06,0.03,0.05,1]
["AprtoJun11East AyrshireCritical","East Ayrshire","Critical","AprtoJun11",0.67,0.05,0.23,0.05,0,1,0.32,0.37,0.18,0.03,0.11,1]
["AprtoJun11East AyrshireSubstantial","East Ayrshire","Substantial","AprtoJun11",0.15,0.23,0.31,0.23,0.08,1,0.62,0.15,0.15,0.08,0,1]
["AprtoJun11East AyrshireModerate","East Ayrshire","Moderate","AprtoJun11",0.13,0.13,0.28999999999999998,0.19,0.25,1,0.42,0.22,0.11,0.08,0.17,1]
["AprtoJun11East AyrshireLow or No Risk","East Ayrshire","Low or No Risk","AprtoJun11",0,0,0,1,0,1,0,0.5,0.5,0,0,1]
["AprtoJun11East AyrshireNot available","East Ayrshire","Not available","AprtoJun11",0.3,0.1,0.15,0.1,0.35,1,0.61,0.04,0.09,0.09,0.17,1]
["AprtoJun11East AyrshireTotals","East Ayrshire","Totals","AprtoJun11",0.33,0.11,0.25,0.14000000000000001,0.17,1,0.44,0.23,0.14000000000000001,0.06,0.13,1]
["AprtoJun11East DunbartonshireCritical","East Dunbartonshire","Critical","AprtoJun11",0.3,0.3,0.2,0.1,0.1,1,0,1,0,0,0,1]
["AprtoJun11East DunbartonshireSubstantial","East Dunbartonshire","Substantial","AprtoJun11",0.57999999999999996,0.2,0.09,0.05,0.08,1,0,1,0,0,0,1]
["AprtoJun11East DunbartonshireModerate","East Dunbartonshire","Moderate","AprtoJun11",0.12,0.09,0.1,0.22,0.47,1,0,1,0,0,0,1]
["AprtoJun11East DunbartonshireLow or No Risk","East Dunbartonshire","Low or No Risk","AprtoJun11",0.19,0.04,0.04,0.19,0.56000000000000005,1,0,1,0,0,0,1]
["AprtoJun11East DunbartonshireNot available","East Dunbartonshire","Not available","AprtoJun11",0.67,0.2,7.0000000000000007E-2,7.0000000000000007E-2,0,1,0,0,0,0,0,0]
["AprtoJun11East DunbartonshireTotals","East Dunbartonshire","Totals","AprtoJun11",0.44,0.16,0.09,0.1,0.21,1,0,1,0,0,0,1]
["AprtoJun11East LothianCritical","East Lothian","Critical","AprtoJun11",0,0,0,0,0,0,0.4,0.46,0.09,0.03,0.02,1]
["AprtoJun11East LothianSubstantial","East Lothian","Substantial","AprtoJun11",0.39,0.19,0.16,0.12,0.14000000000000001,1,0,0,0,0,0,0]
["AprtoJun11East LothianModerate","East Lothian","Moderate","AprtoJun11",0,0,0,0,0,0,0,0,0,0,0,0]
["AprtoJun11East LothianLow or No Risk","East Lothian","Low or No Risk","AprtoJun11",0,0,0,0,0,0,0,0,0,0,0,0]
["AprtoJun11East LothianNot available","East Lothian","Not available","AprtoJun11",0,0,0,0,0,0,0,0,0,0,0,0]
[{"$f":"D260&B260&C260","v":"AprtoJun11East LothianTotals"},"East Lothian","Totals","AprtoJun11",0.39,0.19,0.16,0.12,0.14000000000000001,1,0.4,0.46,0.09,0.03,0.02,1]
["AprtoJun11East RenfrewshireCritical","East Renfrewshire","Critical","AprtoJun11",0.31,0.47,0.13,0.09,0,1,0,0.83,7.0000000000000007E-2,0.1,0,1]
["AprtoJun11East RenfrewshireSubstantial","East Renfrewshire","Substantial","AprtoJun11",0.27,0.45,0.18,0.09,0,1,0,0.89,0.05,0.05,0,1]
["AprtoJun11East RenfrewshireModerate","East Renfrewshire","Moderate","AprtoJun11",0.56999999999999995,0.38,0.05,0,0,1,0,1,0,0,0,1]
["AprtoJun11East RenfrewshireLow or No Risk","East Renfrewshire","Low or No Risk","AprtoJun11",0.33,0.5,0.17,0,0,1,0,0.8,0.2,0,0,1]
["AprtoJun11East RenfrewshireNot available","East Renfrewshire","Not available","AprtoJun11",0.45,0.34,0.16,0.05,0,1,0,0.93,0.05,0.02,0,1]
["AprtoJun11East RenfrewshireTotals","East Renfrewshire","Totals","AprtoJun11",0.4,0.41,0.14000000000000001,0.06,0,1,0,0.9,0.05,0.04,0,1]
["AprtoJun11Edinburgh, City ofCritical","Edinburgh, City of","Critical","AprtoJun11",0,0,0,0,0,0,0,0,0,0,0,0]
["AprtoJun11Edinburgh, City ofSubstantial","Edinburgh, City of","Substantial","AprtoJun11",0,0,0,0,0,0,0,0,0,0,0,0]
["AprtoJun11Edinburgh, City ofModerate","Edinburgh, City of","Moderate","AprtoJun11",0,0,0,0,0,0,0,0,0,0,0,0]
["AprtoJun11Edinburgh, City ofLow or No Risk","Edinburgh, City of","Low or No Risk","AprtoJun11",0,0,0,0,0,0,0,0,0,0,0,0]
["AprtoJun11Edinburgh, City ofNot available","Edinburgh, City of","Not available","AprtoJun11",0.12,0.18,0.34,0.22,0.14000000000000001,1,0.12,0.65,0.1,0.06,7.0000000000000007E-2,1]
["AprtoJun11Edinburgh, City ofTotals","Edinburgh, City of","Totals","AprtoJun11",0.12,0.18,0.34,0.22,0.14000000000000001,1,0.12,0.65,0.1,0.06,7.0000000000000007E-2,1]
["AprtoJun11Eilean SiarCritical","Eilean Siar","Critical","AprtoJun11",0,0,0,0,0,0,0,0,0,0,0,0]
["AprtoJun11Eilean SiarSubstantial","Eilean Siar","Substantial","AprtoJun11",0.13,0.5,0.19,0.06,0.13,1,0.15,0.69,0.15,0,0,1]
["AprtoJun11Eilean SiarModerate","Eilean Siar","Moderate","AprtoJun11",0.5,0.5,0,0,0,1,0,1,0,0,0,1]
["AprtoJun11Eilean SiarLow or No Risk","Eilean Siar","Low or No Risk","AprtoJun11",0,0,0,0,0,0,0,0,0,0,0,0]
["AprtoJun11Eilean SiarNot available","Eilean Siar","Not available","AprtoJun11",0.23,0.31,0.31,0,0.15,1,0.2,0.3,0.5,0,0,1]
["AprtoJun11Eilean SiarTotals","Eilean Siar","Totals","AprtoJun11",0.21,0.42,0.21,0.03,0.12,1,0.16,0.56000000000000005,0.28000000000000003,0,0,1]
["AprtoJun11FalkirkCritical","Falkirk","Critical","AprtoJun11",0.37,0.31,0.13,0.04,0.15,1,0,0,0,0,0,0]
["AprtoJun11FalkirkSubstantial","Falkirk","Substantial","AprtoJun11",0.34,0.24,0.16,0.04,0.23,1,0,0,0,0,0,0]
["AprtoJun11FalkirkModerate","Falkirk","Moderate","AprtoJun11",0.09,0.28000000000000003,0.09,0.09,0.46,1,0,0,0,0,0,0]
["AprtoJun11FalkirkLow or No Risk","Falkirk","Low or No Risk","AprtoJun11",0.27,0.19,0.15,0.15,0.23,1,0,0,0,0,0,0]
["AprtoJun11FalkirkNot available","Falkirk","Not available","AprtoJun11",0.15,0.46,0.23,0.08,0.08,1,0,0,0,0,0,0]
["AprtoJun11FalkirkTotals","Falkirk","Totals","AprtoJun11",0.28000000000000003,0.27,0.14000000000000001,0.06,0.25,1,0,0,0,0,0,0]
["AprtoJun11FifeCritical","Fife","Critical","AprtoJun11",0.16,0.71,0.09,0.01,0.03,1,0,0.87,0.04,0.02,7.0000000000000007E-2,1]
["AprtoJun11FifeSubstantial","Fife","Substantial","AprtoJun11",0.08,0.47,0.22,0.11,0.12,1,0.02,0.6,0.21,0.08,0.1,1]
["AprtoJun11FifeModerate","Fife","Moderate","AprtoJun11",0.03,0.28000000000000003,0.23,0.22,0.24,1,0,0.73,0.2,7.0000000000000007E-2,0,1]
["AprtoJun11FifeLow or No Risk","Fife","Low or No Risk","AprtoJun11",0.09,0.21,0.11,0.11,0.47,1,0,1,0,0,0,1]
["AprtoJun11FifeNot available","Fife","Not available","AprtoJun11",0.09,0.21,0.27,0.09,0.33,1,0,0.33,0.33,0.22,0.11,1]
["AprtoJun11FifeTotals","Fife","Totals","AprtoJun11",0.08,0.41,0.2,0.14000000000000001,0.18,1,0.01,0.64,0.19,0.08,0.09,1]
["AprtoJun11Glasgow CityCritical","Glasgow City","Critical","AprtoJun11",7.0000000000000007E-2,0.32,0.2,0.12,0.28999999999999998,1,0,1,0,0,0,1]
["AprtoJun11Glasgow CitySubstantial","Glasgow City","Substantial","AprtoJun11",0.1,0.17,0.16,0.09,0.48,1,0,1,0,0,0,1]
["AprtoJun11Glasgow CityModerate","Glasgow City","Moderate","AprtoJun11",0.12,7.0000000000000007E-2,0.09,7.0000000000000007E-2,0.65,1,0,1,0,0,0,1]
["AprtoJun11Glasgow CityLow or No Risk","Glasgow City","Low or No Risk","AprtoJun11",0.17,0.22,0.13,0.13,0.35,1,0,1,0,0,0,1]
["AprtoJun11Glasgow CityNot available","Glasgow City","Not available","AprtoJun11",0.3,0.2,0.14000000000000001,0.09,0.27,1,0,1,0,0,0,1]
["AprtoJun11Glasgow CityTotals","Glasgow City","Totals","AprtoJun11",0.14000000000000001,0.16,0.14000000000000001,0.09,0.47,1,0,1,0,0,0,1]
["AprtoJun11HighlandCritical","Highland","Critical","AprtoJun11",0.11,0.3,0.24,0.09,0.25,1,0,0,0,0,0,0]
["AprtoJun11HighlandSubstantial","Highland","Substantial","AprtoJun11",0.12,0.15,0.3,0.1,0.33,1,0,0,0,0,0,0]
["AprtoJun11HighlandModerate","Highland","Moderate","AprtoJun11",0.04,0.15,0.25,0.18,0.38,1,0,0,0,0,0,0]
["AprtoJun11HighlandLow or No Risk","Highland","Low or No Risk","AprtoJun11",0,0.08,0.15,0.15,0.62,1,0,0,0,0,0,0]
["AprtoJun11HighlandNot available","Highland","Not available","AprtoJun11",0.04,0.21,0.27,0.1,0.38,1,0,0,0,0,0,0]
["AprtoJun11HighlandTotals","Highland","Totals","AprtoJun11",0.08,0.2,0.26,0.12,0.34,1,0,0,0,0,0,0]
["AprtoJun11InverclydeCritical","Inverclyde","Critical","AprtoJun11",0.33,0.2,7.0000000000000007E-2,7.0000000000000007E-2,0.33,1,0,0,0,0,0,0]
["AprtoJun11InverclydeSubstantial","Inverclyde","Substantial","AprtoJun11",0.22,0.22,0.16,0.22,0.19,1,0,0,0,0,0,0]
["AprtoJun11InverclydeModerate","Inverclyde","Moderate","AprtoJun11",0.21,0.36,0.14000000000000001,7.0000000000000007E-2,0.21,1,0,0,0,0,0,0]
["AprtoJun11InverclydeLow or No Risk","Inverclyde","Low or No Risk","AprtoJun11",0,0.33,0.67,0,0,1,0,0,0,0,0,0]
["AprtoJun11InverclydeNot available","Inverclyde","Not available","AprtoJun11",0.08,0.38,0.31,0.15,0.08,1,0,0,0,0,0,0]
["AprtoJun11InverclydeTotals","Inverclyde","Totals","AprtoJun11",0.21,0.27,0.18,0.14000000000000001,0.19,1,0,0,0,0,0,0]
["AprtoJun11MidlothianCritical","Midlothian","Critical","AprtoJun11",0,0,0,0,0,0,0,0,0,0,0,0]
["AprtoJun11MidlothianSubstantial","Midlothian","Substantial","AprtoJun11",0,0,0,0,0,0,0,0,0,0,0,0]
["AprtoJun11MidlothianModerate","Midlothian","Moderate","AprtoJun11",0,0,0,0,0,0,0,0,0,0,0,0]
["AprtoJun11MidlothianLow or No Risk","Midlothian","Low or No Risk","AprtoJun11",0,0,0,0,0,0,0,0,0,0,0,0]
["AprtoJun11MidlothianNot available","Midlothian","Not available","AprtoJun11",0.02,0.16,0.23,0.1,0.5,1,0,0,0,0,0,0]
["AprtoJun11MidlothianTotals","Midlothian","Totals","AprtoJun11",0.02,0.16,0.23,0.1,0.5,1,0,0,0,0,0,0]
["AprtoJun11MorayCritical","Moray","Critical","AprtoJun11",0.5,0.3,0.1,0,0.1,1,0.36,0.59,0.05,0,0,1]
["AprtoJun11MoraySubstantial","Moray","Substantial","AprtoJun11",0.33,0.44,0.19,0.03,0,1,0.33,0.57999999999999996,0.09,0,0,1]
["AprtoJun11MorayModerate","Moray","Moderate","AprtoJun11",0,1,0,0,0,1,0,0.5,0.5,0,0,1]
["AprtoJun11MorayLow or No Risk","Moray","Low or No Risk","AprtoJun11",0,0,0,0,0,0,0,0,0,0,0,0]
["AprtoJun11MorayNot available","Moray","Not available","AprtoJun11",0.16,0.38,0.41,0.06,0,1,0.13,0.63,0.25,0,0,1]
["AprtoJun11MorayTotals","Moray","Totals","AprtoJun11",0.28999999999999998,0.42,0.25,0.04,0.01,1,0.32,0.59,0.09,0,0,1]
["AprtoJun11North AyrshireCritical","North Ayrshire","Critical","AprtoJun11",0.43,0.28999999999999998,0,0.14000000000000001,0.14000000000000001,1,0.38,0.63,0,0,0,1]
["AprtoJun11North AyrshireSubstantial","North Ayrshire","Substantial","AprtoJun11",0.2,0.27,0.16,0.18,0.18,1,0.41,0.56000000000000005,0.03,0,0,1]
["AprtoJun11North AyrshireModerate","North Ayrshire","Moderate","AprtoJun11",0,0,0.33,0,0.67,1,0.67,0,0.33,0,0,1]
[{"$f":"D324&B324&C324","v":"AprtoJun11North AyrshireLow or No Risk"},"North Ayrshire","Low or No Risk","AprtoJun11",0,0,0.5,0.5,0,1,0,0,0,0,0,0]
["AprtoJun11North AyrshireNot available","North Ayrshire","Not available","AprtoJun11",0.6,0.4,0,0,0,1,0,0,0,0,0,0]
["AprtoJun11North AyrshireTotals","North Ayrshire","Totals","AprtoJun11",0.24,0.26,0.15,0.17,0.18,1,0.42,0.53,0.05,0,0,1]
["AprtoJun11North LanarkshireCritical","North Lanarkshire","Critical","AprtoJun11",0.56999999999999995,0.23,0.1,0.03,7.0000000000000007E-2,1,0.28000000000000003,0.57999999999999996,0.08,0.04,0.02,1]
["AprtoJun11North LanarkshireSubstantial","North Lanarkshire","Substantial","AprtoJun11",0.54,0.23,0.06,0.04,0.13,1,0.42,0.45,0.05,0.01,7.0000000000000007E-2,1]
["AprtoJun11North LanarkshireModerate","North Lanarkshire","Moderate","AprtoJun11",0.66,0.15,0.05,0.04,0.1,1,0.32,0.56000000000000005,0.04,0,0.08,1]
["AprtoJun11North LanarkshireLow or No Risk","North Lanarkshire","Low or No Risk","AprtoJun11",0.57999999999999996,0.24,0.11,0.03,0.05,1,0.5,0.15,0.05,0,0.3,1]
["AprtoJun11North LanarkshireNot available","North Lanarkshire","Not available","AprtoJun11",0,0,0,0,0,0,0,0,0,0,0,0]
["AprtoJun11North LanarkshireTotals","North Lanarkshire","Totals","AprtoJun11",0.57999999999999996,0.21,0.08,0.04,0.08,1,0.34,0.52,0.06,0.02,0.06,1]
["AprtoJun11Orkney islandsCritical","Orkney islands","Critical","AprtoJun11",0,0,0,0,0,0,0,0,0,0,0,0]
["AprtoJun11Orkney islandsSubstantial","Orkney islands","Substantial","AprtoJun11",0,0,0,0,0,0,0,0,0,0,0,0]
["AprtoJun11Orkney islandsModerate","Orkney islands","Moderate","AprtoJun11",0,0,0,0,0,0,0,0,0,0,0,0]
["AprtoJun11Orkney islandsLow or No Risk","Orkney islands","Low or No Risk","AprtoJun11",0,0,0,0,0,0,0,0,0,0,0,0]
["AprtoJun11Orkney islandsNot available","Orkney islands","Not available","AprtoJun11",0,0,0,0,0,0,0,0,0,0,0,0]
["AprtoJun11Orkney islandsTotals","Orkney islands","Totals","AprtoJun11",0,0,0,0,0,0,0,0,0,0,0,0]
["AprtoJun11Perth & KinrossCritical","Perth & Kinross","Critical","AprtoJun11",0,0,0,0,0,0,0,0.5,0.5,0,0,1]
["AprtoJun11Perth & KinrossSubstantial","Perth & Kinross","Substantial","AprtoJun11",0.12,0.31,0.1,0.12,0.35,1,0,0.2,0,0,0.8,1]
["AprtoJun11Perth & KinrossModerate","Perth & Kinross","Moderate","AprtoJun11",0.05,0.24,0.13,7.0000000000000007E-2,0.51,1,0.14000000000000001,0.14000000000000001,0,0.43,0.28999999999999998,1]
["AprtoJun11Perth & KinrossLow or No Risk","Perth & Kinross","Low or No Risk","AprtoJun11",0.03,0.28999999999999998,0.24,0.06,0.38,1,0,0.33,0,0,0.67,1]
["AprtoJun11Perth & KinrossNot available","Perth & Kinross","Not available","AprtoJun11",0.59,0.14000000000000001,0.1,0.1,7.0000000000000007E-2,1,0,0,0,0,1,1]
["AprtoJun11Perth & KinrossTotals","Perth & Kinross","Totals","AprtoJun11",0.13,0.25,0.14000000000000001,0.08,0.41,1,0.05,0.21,0.05,0.16,0.53,1]
["AprtoJun11RenfrewshireCritical","Renfrewshire","Critical","AprtoJun11",0.83,0.08,0.08,0,0,1,0.54,0.11,0.04,0.13,0.19,1]
["AprtoJun11RenfrewshireSubstantial","Renfrewshire","Substantial","AprtoJun11",0.6,0.08,0,0.08,0.24,1,0.56999999999999995,0.11,0,0.04,0.28000000000000003,1]
["AprtoJun11RenfrewshireModerate","Renfrewshire","Moderate","AprtoJun11",0.5,0.5,0,0,0,1,1,0,0,0,0,1]
["AprtoJun11RenfrewshireLow or No Risk","Renfrewshire","Low or No Risk","AprtoJun11",1,0,0,0,0,1,0,0,0,0,0,0]
["AprtoJun11RenfrewshireNot available","Renfrewshire","Not available","AprtoJun11",0.26,0.13,0.1,0.13,0.39,1,0.79,0.02,0,0.04,0.15,1]
["AprtoJun11RenfrewshireTotals","Renfrewshire","Totals","AprtoJun11",0.34,0.12,0.08,0.11,0.34,1,0.66,7.0000000000000007E-2,0.01,0.06,0.19,1]
["AprtoJun11Scottish BordersCritical","Scottish Borders","Critical","AprtoJun11",0,0,0,0,0,0,0,0,0,0,0,0]
["AprtoJun11Scottish BordersSubstantial","Scottish Borders","Substantial","AprtoJun11",0,0,0,0,0,0,0,0,0,0,0,0]
["AprtoJun11Scottish BordersModerate","Scottish Borders","Moderate","AprtoJun11",0,0,0,0,0,0,0,0,0,0,0,0]
["AprtoJun11Scottish BordersLow or No Risk","Scottish Borders","Low or No Risk","AprtoJun11",0,0,0,0,0,0,0,0,0,0,0,0]
["AprtoJun11Scottish BordersNot available","Scottish Borders","Not available","AprtoJun11",0,0,0,0,0,0,0,0,0,0,0,0]
["AprtoJun11Scottish BordersTotals","Scottish Borders","Totals","AprtoJun11",0,0,0,0,0,0,0,0,0,0,0,0]
["AprtoJun11Shetland islandsCritical","Shetland islands","Critical","AprtoJun11",0.5,0.5,0,0,0,1,0.17,0.83,0,0,0,1]
["AprtoJun11Shetland islandsSubstantial","Shetland islands","Substantial","AprtoJun11",0,0,0,0,0,0,0,1,0,0,0,1]
["AprtoJun11Shetland islandsModerate","Shetland islands","Moderate","AprtoJun11",0.25,0,0.5,0.25,0,1,0,0.67,0.33,0,0,1]
["AprtoJun11Shetland islandsLow or No Risk","Shetland islands","Low or No Risk","AprtoJun11",0,0,1,0,0,1,1,0,0,0,0,1]
["AprtoJun11Shetland islandsNot available","Shetland islands","Not available","AprtoJun11",0.22,0.28999999999999998,0.22,0.04,0.22,1,0,1,0,0,0,1]
["AprtoJun11Shetland islandsTotals","Shetland islands","Totals","AprtoJun11",0.23,0.27,0.25,0.06,0.19,1,7.0000000000000007E-2,0.89,0.04,0,0,1]
["AprtoJun11South AyrshireCritical","South Ayrshire","Critical","AprtoJun11",0,0,0,0,0,0,0,0,0,0,0,0]
["AprtoJun11South AyrshireSubstantial","South Ayrshire","Substantial","AprtoJun11",0,0,0,0,0,0,0,0,0,0,0,0]
["AprtoJun11South AyrshireModerate","South Ayrshire","Moderate","AprtoJun11",0,0,0,0,0,0,0,0,0,0,0,0]
["AprtoJun11South AyrshireLow or No Risk","South Ayrshire","Low or No Risk","AprtoJun11",0,0,0,0,0,0,0,0,0,0,0,0]
["AprtoJun11South AyrshireNot available","South Ayrshire","Not available","AprtoJun11",0,0,0,0,0,0,0,0,0,0,0,0]
["AprtoJun11South AyrshireTotals","South Ayrshire","Totals","AprtoJun11",0,0,0,0,0,0,0,0,0,0,0,0]
["AprtoJun11South LanarkshireCritical","South Lanarkshire","Critical","AprtoJun11",0,0,0,0,0,0,0,0,0,0,0,0]
["AprtoJun11South LanarkshireSubstantial","South Lanarkshire","Substantial","AprtoJun11",0,0,0,0,0,0,0,0,0,0,0,0]
["AprtoJun11South LanarkshireModerate","South Lanarkshire","Moderate","AprtoJun11",0,0,0,0,0,0,0,0,0,0,0,0]
["AprtoJun11South LanarkshireLow or No Risk","South Lanarkshire","Low or No Risk","AprtoJun11",0,0,0,0,0,0,0,0,0,0,0,0]
["AprtoJun11South LanarkshireNot available","South Lanarkshire","Not available","AprtoJun11",0,0,0,0,0,0,0,0,0,0,0,0]
["AprtoJun11South LanarkshireTotals","South Lanarkshire","Totals","AprtoJun11",0,0,0,0,0,0,0,0,0,0,0,0]
["AprtoJun11StirlingCritical","Stirling","Critical","AprtoJun11",0.84,0.08,0.02,0,0.06,1,0,0.94,0,0.06,0,1]
["AprtoJun11StirlingSubstantial","Stirling","Substantial","AprtoJun11",0.51,0.15,0.01,0.04,0.28000000000000003,1,0,0.69,0.31,0,0,1]
["AprtoJun11StirlingModerate","Stirling","Moderate","AprtoJun11",0,0.18,0.09,0.09,0.64,1,1,0,0,0,0,1]
["AprtoJun11StirlingLow or No Risk","Stirling","Low or No Risk","AprtoJun11",0,0,0,0,0,0,0,0,0,0,0,0]
["AprtoJun11StirlingNot available","Stirling","Not available","AprtoJun11",0.3,0.28000000000000003,0.1,0.05,0.27,1,0.14000000000000001,0.52,0.14000000000000001,0.19,0,1]
["AprtoJun11StirlingTotals","Stirling","Totals","AprtoJun11",0.52,0.17,0.04,0.03,0.23,1,0.11,0.71,0.1,0.08,0,1]
["AprtoJun11West DunbartonshireCritical","West Dunbartonshire","Critical","AprtoJun11",0,0,0,0,0,0,0,0,0,0,0,0]
["AprtoJun11West DunbartonshireSubstantial","West Dunbartonshire","Substantial","AprtoJun11",0.22,0.34,0.22,0,0.22,1,0.46,0.54,0,0,0,1]
["AprtoJun11West DunbartonshireModerate","West Dunbartonshire","Moderate","AprtoJun11",0.12,0.39,0.12,0.06,0.3,1,0.28999999999999998,0.65,0.06,0,0,1]
["AprtoJun11West DunbartonshireLow or No Risk","West Dunbartonshire","Low or No Risk","AprtoJun11",0.25,0.24,0.12,0.04,0.35,1,0.25,0.63,0.13,0,0,1]
["AprtoJun11West DunbartonshireNot available","West Dunbartonshire","Not available","AprtoJun11",0,0,0,0,0,0,0,0,0,0,0,0]
["AprtoJun11West DunbartonshireTotals","West Dunbartonshire","Totals","AprtoJun11",0.21,0.3,0.14000000000000001,0.04,0.31,1,0.4,0.56999999999999995,0.03,0,0,1]
["AprtoJun11West LothianCritical","West Lothian","Critical","AprtoJun11",7.0000000000000007E-2,0.24,0.24,0,0.44,1,0.34,0.48,0.08,0.05,0.05,1]
[{"$f":"D388&B388&C388","v":"AprtoJun11West LothianSubstantial"},"West Lothian","Substantial","AprtoJun11",0.05,0.23,0.05,0.23,0.45,1,0.4,0.33,0.17,0.06,0.04,1]
["AprtoJun11West LothianModerate","West Lothian","Moderate","AprtoJun11",0.05,0.33,0.1,0.24,0.28999999999999998,1,0.3,0.6,0.1,0,0,1]
["AprtoJun11West LothianLow or No Risk","West Lothian","Low or No Risk","AprtoJun11",0,0,0.25,0,0.75,1,0.45,0.45,0.09,0,0,1]
["AprtoJun11West LothianNot available","West Lothian","Not available","AprtoJun11",0.09,0.09,0.09,0,0.73,1,0.28999999999999998,0.56999999999999995,0,0,0.14000000000000001,1]
["AprtoJun11West LothianTotals","West Lothian","Totals","AprtoJun11",0.06,0.23,0.14000000000000001,0.12,0.46,1,0.36,0.45,0.11,0.04,0.04,1]
["AprtoJun11SCOTLAND TOTALSCritical","SCOTLAND TOTALS","Critical","AprtoJun11",0.34,0.28999999999999998,0.15,0.06,0.15,1,0.3,0.52,0.09,0.04,0.05,1]
["AprtoJun11SCOTLAND TOTALSSubstantial","SCOTLAND TOTALS","Substantial","AprtoJun11",0.24,0.28000000000000003,0.16,0.09,0.23,1,0.15,0.73,0.06,0.03,0.04,1]
["AprtoJun11SCOTLAND TOTALSModerate","SCOTLAND TOTALS","Moderate","AprtoJun11",0.15,0.19,0.14000000000000001,0.13,0.39,1,0.21,0.7,0.05,0.02,0.03,1]
["AprtoJun11SCOTLAND TOTALSLow or No Risk","SCOTLAND TOTALS","Low or No Risk","AprtoJun11",0.25,0.21,0.13,7.0000000000000007E-2,0.34,1,0.23,0.62,7.0000000000000007E-2,0.01,0.08,1]
["AprtoJun11SCOTLAND TOTALSNot available","SCOTLAND TOTALS","Not available","AprtoJun11",0.18,0.21,0.25,0.15,0.21,1,0.23,0.56999999999999995,0.08,0.05,7.0000000000000007E-2,1]
["AprtoJun11SCOTLAND TOTALSTotals","SCOTLAND TOTALS","Totals","AprtoJun11",0.22,0.24,0.18,0.11,0.25,1,0.21,0.64,7.0000000000000007E-2,0.04,0.05,1]
["JultoSep11Aberdeen CityCritical","Aberdeen City","Critical","JultoSep11",0.19,0.22,0.31,0.09,0.19,1,0.17,0.67,0.17,0,0,1]
["JultoSep11Aberdeen CitySubstantial","Aberdeen City","Substantial","JultoSep11",0.15,0.36,0.15,0.1,0.24,1,0.32,0.51,7.0000000000000007E-2,0.1,0,1]
["JultoSep11Aberdeen CityModerate","Aberdeen City","Moderate","JultoSep11",0.4,0,0.2,0.13,0.27,1,0.28999999999999998,0.28999999999999998,0.28999999999999998,0,0.14000000000000001,1]
["JultoSep11Aberdeen CityLow or No Risk","Aberdeen City","Low or No Risk","JultoSep11",0,0,1,0,0,1,0,1,0,0,0,1]
["JultoSep11Aberdeen CityNot available","Aberdeen City","Not available","JultoSep11",0,0,0,0,0,0,0,0,0,0,0,0]
["JultoSep11Aberdeen CityTotals","Aberdeen City","Totals","JultoSep11",0.2,0.26,0.21,0.1,0.22,1,0.28999999999999998,0.51,0.11,7.0000000000000007E-2,0.02,1]
["JultoSep11AberdeenshireCritical","Aberdeenshire","Critical","JultoSep11",0,0,0,0,1,1,0,0,0,0,0,0]
["JultoSep11AberdeenshireSubstantial","Aberdeenshire","Substantial","JultoSep11",0,1,0,0,0,1,0,0,0,0,0,0]
["JultoSep11AberdeenshireModerate","Aberdeenshire","Moderate","JultoSep11",0,0,0.25,0.25,0.5,1,0,0,0,0,0,0]
["JultoSep11AberdeenshireLow or No Risk","Aberdeenshire","Low or No Risk","JultoSep11",0.14000000000000001,0.28999999999999998,0.14000000000000001,7.0000000000000007E-2,0.36,1,0,0,0,0,0,0]
["JultoSep11AberdeenshireNot available","Aberdeenshire","Not available","JultoSep11",0.08,0.34,0.18,0.09,0.31,1,0,0,0,0,0,0]
["JultoSep11AberdeenshireTotals","Aberdeenshire","Totals","JultoSep11",0.08,0.33,0.18,0.09,0.32,1,0,0,0,0,0,0]
["JultoSep11AngusCritical","Angus","Critical","JultoSep11",0,0.24,0.17,0.14000000000000001,0.45,1,0.31,0.46,0.17,0.03,0.03,1]
["JultoSep11AngusSubstantial","Angus","Substantial","JultoSep11",0.39,0.08,0.06,0.14000000000000001,0.33,1,0.14000000000000001,0.81,0.03,0.03,0,1]
["JultoSep11AngusModerate","Angus","Moderate","JultoSep11",0.33,0.11,0.02,0.18,0.36,1,0.26,0.57999999999999996,0.1,0.03,0.03,1]
["JultoSep11AngusLow or No Risk","Angus","Low or No Risk","JultoSep11",0.23,0.17,0.19,0.06,0.34,1,0.04,0.96,0,0,0,1]
["JultoSep11AngusNot available","Angus","Not available","JultoSep11",0,0,0,0,0,0,1,0,0,0,0,1]
["JultoSep11AngusTotals","Angus","Totals","JultoSep11",0.25,0.15,0.11,0.13,0.36,1,0.18,0.72,0.06,0.02,0.01,1]
["JultoSep11Argyll & ButeCritical","Argyll & Bute","Critical","JultoSep11",0.22,0.33,0.17,0.1,0.18,1,0.44,0.33,7.0000000000000007E-2,0.05,0.12,1]
["JultoSep11Argyll & ButeSubstantial","Argyll & Bute","Substantial","JultoSep11",0.2,0.26,0.2,0.16,0.19,1,0.46,0.21,0.06,0.15,0.13,1]
["JultoSep11Argyll & ButeModerate","Argyll & Bute","Moderate","JultoSep11",0,0,1,0,0,1,0,0,0,0,1,1]
["JultoSep11Argyll & ButeLow or No Risk","Argyll & Bute","Low or No Risk","JultoSep11",0,0.5,0.25,0,0.25,1,1,0,0,0,0,1]
["JultoSep11Argyll & ButeNot available","Argyll & Bute","Not available","JultoSep11",0,0,0,0,0,0,0.55000000000000004,0.27,0.09,0,0.09,1]
["JultoSep11Argyll & ButeTotals","Argyll & Bute","Totals","JultoSep11",0.2,0.28999999999999998,0.19,0.14000000000000001,0.19,1,0.46,0.26,7.0000000000000007E-2,0.09,0.13,1]
["JultoSep11ClackmannanshireCritical","Clackmannanshire","Critical","JultoSep11",0,0,0,0,0,0,0,0,0,0,0,0]
["JultoSep11ClackmannanshireSubstantial","Clackmannanshire","Substantial","JultoSep11",0.06,0.47,0.06,0.12,0.28999999999999998,1,0,0,0,0,0,0]
["JultoSep11ClackmannanshireModerate","Clackmannanshire","Moderate","JultoSep11",0.03,0.24,0.28000000000000003,0.1,0.34,1,0,0,0,0,0,0]
["JultoSep11ClackmannanshireLow or No Risk","Clackmannanshire","Low or No Risk","JultoSep11",7.0000000000000007E-2,7.0000000000000007E-2,0.14000000000000001,0.21,0.5,1,0,0,0,0,0,0]
["JultoSep11ClackmannanshireNot available","Clackmannanshire","Not available","JultoSep11",0,0,0,0,0,0,0.47,0.48,0.05,0,0,1]
["JultoSep11ClackmannanshireTotals","Clackmannanshire","Totals","JultoSep11",0.05,0.23,0.18,0.15,0.39,1,0.47,0.48,0.05,0,0,1]
["JultoSep11Dumfries and GallowayCritical","Dumfries and Galloway","Critical","JultoSep11",0,0,0,0,0,0,0,0,0,0,0,0]
["JultoSep11Dumfries and GallowaySubstantial","Dumfries and Galloway","Substantial","JultoSep11",0,0,0,0,0,0,0,0,0,0,0,0]
["JultoSep11Dumfries and GallowayModerate","Dumfries and Galloway","Moderate","JultoSep11",0,0,0,0,0,0,0,0,0,0,0,0]
["JultoSep11Dumfries and GallowayLow or No Risk","Dumfries and Galloway","Low or No Risk","JultoSep11",0,0,0,0,0,0,0,0,0,0,0,0]
["JultoSep11Dumfries and GallowayNot available","Dumfries and Galloway","Not available","JultoSep11",0.48,0.42,0.03,0.04,0.03,1,0.09,0.67,0.14000000000000001,0.1,0.01,1]
["JultoSep11Dumfries and GallowayTotals","Dumfries and Galloway","Totals","JultoSep11",0.48,0.42,0.03,0.04,0.03,1,0.09,0.67,0.14000000000000001,0.1,0.01,1]
["JultoSep11Dundee CityCritical","Dundee City","Critical","JultoSep11",0.28999999999999998,0.43,0.21,7.0000000000000007E-2,0,1,0,0,0,0,0,0]
["JultoSep11Dundee CitySubstantial","Dundee City","Substantial","JultoSep11",0.13,0.18,0.08,0.15,0.48,1,0,0,0,0,0,0]
["JultoSep11Dundee CityModerate","Dundee City","Moderate","JultoSep11",0.08,0.23,0.08,0.06,0.56000000000000005,1,0,0,0,0,0,0]
["JultoSep11Dundee CityLow or No Risk","Dundee City","Low or No Risk","JultoSep11",0.1,0.21,0.17,0.19,0.33,1,0,0,0,0,0,0]
["JultoSep11Dundee CityNot available","Dundee City","Not available","JultoSep11",0,0,1,0,0,1,0,0,0,0,0,0]
["JultoSep11Dundee CityTotals","Dundee City","Totals","JultoSep11",0.11,0.23,0.11,0.11,0.45,1,0,0,0,0,0,0]
["JultoSep11East AyrshireCritical","East Ayrshire","Critical","JultoSep11",0.74,0.06,0.2,0,0,1,0.6,0.25,0.15,0,0,1]
["JultoSep11East AyrshireSubstantial","East Ayrshire","Substantial","JultoSep11",0.13,0.17,0.04,0.13,0.52,1,0.43,0.26,0.13,0.17,0,1]
["JultoSep11East AyrshireModerate","East Ayrshire","Moderate","JultoSep11",0.12,0.34,0.22,7.0000000000000007E-2,0.24,1,0.35,0.22,0.24,0.11,0.08,1]
["JultoSep11East AyrshireLow or No Risk","East Ayrshire","Low or No Risk","JultoSep11",0,1,0,0,0,1,1,0,0,0,0,1]
["JultoSep11East AyrshireNot available","East Ayrshire","Not available","JultoSep11",0.2,0.2,0.2,0.2,0.2,1,0,0,1,0,0,1]
["JultoSep11East AyrshireTotals","East Ayrshire","Totals","JultoSep11",0.33,0.22,0.17,7.0000000000000007E-2,0.22,1,0.44,0.23,0.2,0.1,0.04,1]
["JultoSep11East DunbartonshireCritical","East Dunbartonshire","Critical","JultoSep11",0.67,0.33,0,0,0,1,0,0.86,0,0.14000000000000001,0,1]
["JultoSep11East DunbartonshireSubstantial","East Dunbartonshire","Substantial","JultoSep11",0.76,0.13,0.06,0.02,0.02,1,0,0.99,0,0.01,0,1]
["JultoSep11East DunbartonshireModerate","East Dunbartonshire","Moderate","JultoSep11",0.28000000000000003,0.12,0.09,0.17,0.34,1,0,1,0,0,0,1]
["JultoSep11East DunbartonshireLow or No Risk","East Dunbartonshire","Low or No Risk","JultoSep11",0.28999999999999998,0.21,0,7.0000000000000007E-2,0.43,1,0,1,0,0,0,1]
["JultoSep11East DunbartonshireNot available","East Dunbartonshire","Not available","JultoSep11",0,0,0,0,0,0,0,0,0,0,0,0]
[{"$f":"D452&B452&C452","v":"JultoSep11East DunbartonshireTotals"},"East Dunbartonshire","Totals","JultoSep11",0.62,0.14000000000000001,0.06,0.06,0.12,1,0,0.99,0,0.01,0,1]
["JultoSep11East LothianCritical","East Lothian","Critical","JultoSep11",0.5,0,0.25,0,0.25,1,0.75,0.25,0,0,0,1]
["JultoSep11East LothianSubstantial","East Lothian","Substantial","JultoSep11",0.56999999999999995,0.16,0.09,0.08,0.11,1,0.55000000000000004,0.28999999999999998,0.08,0.05,0.03,1]
["JultoSep11East LothianModerate","East Lothian","Moderate","JultoSep11",0,0,0,0,0,0,0,0,0,0,0,0]
["JultoSep11East LothianLow or No Risk","East Lothian","Low or No Risk","JultoSep11",0,0,0,0,0,0,0,0,0,0,0,0]
["JultoSep11East LothianNot available","East Lothian","Not available","JultoSep11",0,0,0,0,0,0,0,0,0,0,0,0]
["JultoSep11East LothianTotals","East Lothian","Totals","JultoSep11",0.56000000000000005,0.15,0.09,0.08,0.11,1,0.56000000000000005,0.28999999999999998,0.08,0.05,0.03,1]
["JultoSep11East RenfrewshireCritical","East Renfrewshire","Critical","JultoSep11",0.4,0.5,7.0000000000000007E-2,0.03,0,1,0,0.87,0.1,0.03,0,1]
["JultoSep11East RenfrewshireSubstantial","East Renfrewshire","Substantial","JultoSep11",0.3,0.26,0.35,0.09,0,1,0.04,0.61,0.26,0.09,0,1]
["JultoSep11East RenfrewshireModerate","East Renfrewshire","Moderate","JultoSep11",0.26,0.48,0.22,0.04,0,1,0,0.61,0.22,0.17,0,1]
["JultoSep11East RenfrewshireLow or No Risk","East Renfrewshire","Low or No Risk","JultoSep11",0.56000000000000005,0.42,0.02,0,0,1,0,0.98,0.02,0,0,1]
["JultoSep11East RenfrewshireNot available","East Renfrewshire","Not available","JultoSep11",0.36,0.6,0.04,0,0,1,0,0.96,0.04,0,0,1]
["JultoSep11East RenfrewshireTotals","East Renfrewshire","Totals","JultoSep11",0.4,0.45,0.12,0.03,0,1,0.01,0.83,0.11,0.05,0,1]
["JultoSep11Edinburgh, City ofCritical","Edinburgh, City of","Critical","JultoSep11",0,0,0,0,0,0,0,0,0,0,0,0]
["JultoSep11Edinburgh, City ofSubstantial","Edinburgh, City of","Substantial","JultoSep11",0,0,0,0,0,0,0,0,0,0,0,0]
["JultoSep11Edinburgh, City ofModerate","Edinburgh, City of","Moderate","JultoSep11",0,0,0,0,0,0,0,0,0,0,0,0]
["JultoSep11Edinburgh, City ofLow or No Risk","Edinburgh, City of","Low or No Risk","JultoSep11",0,0,0,0,0,0,0,0,0,0,0,0]
["JultoSep11Edinburgh, City ofNot available","Edinburgh, City of","Not available","JultoSep11",0.13,0.22,0.26,0.23,0.16,1,7.0000000000000007E-2,0.64,0.14000000000000001,0.11,0.04,1]
["JultoSep11Edinburgh, City ofTotals","Edinburgh, City of","Totals","JultoSep11",0.13,0.22,0.26,0.23,0.16,1,7.0000000000000007E-2,0.64,0.14000000000000001,0.11,0.04,1]
["JultoSep11Eilean SiarCritical","Eilean Siar","Critical","JultoSep11",0,0,0,0,0,0,0,0,0,0,0,0]
["JultoSep11Eilean SiarSubstantial","Eilean Siar","Substantial","JultoSep11",0,0,0,0,0,0,0,0,0,0,0,0]
["JultoSep11Eilean SiarModerate","Eilean Siar","Moderate","JultoSep11",0,0,0,0,0,0,0,0,0,0,0,0]
["JultoSep11Eilean SiarLow or No Risk","Eilean Siar","Low or No Risk","JultoSep11",0,0,0,0,0,0,0,0,0,0,0,0]
["JultoSep11Eilean SiarNot available","Eilean Siar","Not available","JultoSep11",0,0,0,0,0,0,0,0,0,0,0,0]
["JultoSep11Eilean SiarTotals","Eilean Siar","Totals","JultoSep11",0,0,0,0,0,0,0,0,0,0,0,0]
["JultoSep11FalkirkCritical","Falkirk","Critical","JultoSep11",0.33,0.38,0.06,0.05,0.17,1,0.72,0.21,0.04,0.02,0.01,1]
["JultoSep11FalkirkSubstantial","Falkirk","Substantial","JultoSep11",0.11,0.5,0.06,0.04,0.28999999999999998,1,0.65,0.35,0,0,0,1]
["JultoSep11FalkirkModerate","Falkirk","Moderate","JultoSep11",0.13,0.28000000000000003,0.25,0.06,0.28000000000000003,1,0,0.5,0.5,0,0,1]
["JultoSep11FalkirkLow or No Risk","Falkirk","Low or No Risk","JultoSep11",0,0.13,0.13,0.13,0.63,1,1,0,0,0,0,1]
["JultoSep11FalkirkNot available","Falkirk","Not available","JultoSep11",0,0,0,0,0,0,0.44,0.56000000000000005,0,0,0,1]
["JultoSep11FalkirkTotals","Falkirk","Totals","JultoSep11",0.18,0.41,0.1,0.05,0.26,1,0.65,0.28999999999999998,0.03,0.01,0.01,1]
["JultoSep11FifeCritical","Fife","Critical","JultoSep11",0.18,0.33,0.14000000000000001,0.14000000000000001,0.22,1,0,0.79,0.06,0.09,0.06,1]
["JultoSep11FifeSubstantial","Fife","Substantial","JultoSep11",0.06,0.28000000000000003,0.27,0.12,0.27,1,0.04,0.7,0.15,0.06,0.05,1]
["JultoSep11FifeModerate","Fife","Moderate","JultoSep11",0.02,0.44,0.22,0.12,0.2,1,7.0000000000000007E-2,0.33,0.27,0.27,7.0000000000000007E-2,1]
["JultoSep11FifeLow or No Risk","Fife","Low or No Risk","JultoSep11",0,0.25,0,0.25,0.5,1,0,0.5,0.5,0,0,1]
["JultoSep11FifeNot available","Fife","Not available","JultoSep11",0.06,0.26,0.22,0.13,0.32,1,0.06,0.5,0.38,0,0.06,1]
["JultoSep11FifeTotals","Fife","Totals","JultoSep11",0.06,0.28000000000000003,0.23,0.13,0.3,1,0.04,0.67,0.16,0.08,0.05,1]
["JultoSep11Glasgow CityCritical","Glasgow City","Critical","JultoSep11",0.04,0.24,0.19,0.11,0.42,1,0,1,0,0,0,1]
["JultoSep11Glasgow CitySubstantial","Glasgow City","Substantial","JultoSep11",0.09,0.16,0.21,0.11,0.42,1,0,1,0,0,0,1]
["JultoSep11Glasgow CityModerate","Glasgow City","Moderate","JultoSep11",7.0000000000000007E-2,0.13,7.0000000000000007E-2,7.0000000000000007E-2,0.65,1,0,1,0,0,0,1]
["JultoSep11Glasgow CityLow or No Risk","Glasgow City","Low or No Risk","JultoSep11",0.12,0.24,0.04,0.04,0.56000000000000005,1,0,1,0,0,0,1]
["JultoSep11Glasgow CityNot available","Glasgow City","Not available","JultoSep11",0.25,0.21,0.16,0.06,0.32,1,0,1,0,0,0,1]
["JultoSep11Glasgow CityTotals","Glasgow City","Totals","JultoSep11",0.11,0.17,0.17,0.09,0.46,1,0,1,0,0,0,1]
["JultoSep11HighlandCritical","Highland","Critical","JultoSep11",0.22,0.32,0.25,0.09,0.12,1,0,0,0,0,0,0]
["JultoSep11HighlandSubstantial","Highland","Substantial","JultoSep11",0.1,0.32,0.19,0.14000000000000001,0.25,1,0,0,0,0,0,0]
["JultoSep11HighlandModerate","Highland","Moderate","JultoSep11",0.1,0.18,0.15,0.16,0.42,1,0,0,0,0,0,0]
["JultoSep11HighlandLow or No Risk","Highland","Low or No Risk","JultoSep11",0,0,0.22,0.22,0.56000000000000005,1,0,0,0,0,0,0]
["JultoSep11HighlandNot available","Highland","Not available","JultoSep11",0.08,0.32,0.12,0.05,0.42,1,0,0,0,0,0,0]
["JultoSep11HighlandTotals","Highland","Totals","JultoSep11",0.12,0.28000000000000003,0.18,0.12,0.28999999999999998,1,0,0,0,0,0,0]
["JultoSep11InverclydeCritical","Inverclyde","Critical","JultoSep11",0,0.22,0.39,0.35,0.04,1,0.57999999999999996,0.19,0.12,0,0.12,1]
["JultoSep11InverclydeSubstantial","Inverclyde","Substantial","JultoSep11",7.0000000000000007E-2,0.27,0.17,0.17,0.33,1,0.68,0.12,0.12,7.0000000000000007E-2,0,1]
["JultoSep11InverclydeModerate","Inverclyde","Moderate","JultoSep11",0.06,0.24,0.24,0.18,0.28999999999999998,1,0.12,0.54,0.08,0.19,0.08,1]
["JultoSep11InverclydeLow or No Risk","Inverclyde","Low or No Risk","JultoSep11",0.22,0.22,0,0.22,0.33,1,0,0,0,0,0,0]
["JultoSep11InverclydeNot available","Inverclyde","Not available","JultoSep11",0,1,0,0,0,1,0,0,0,0,1,1]
["JultoSep11InverclydeTotals","Inverclyde","Totals","JultoSep11",0.06,0.27,0.22,0.22,0.23,1,0.49,0.26,0.11,0.09,0.06,1]
["JultoSep11MidlothianCritical","Midlothian","Critical","JultoSep11",0,0,0,0,0,0,0,0,0,0,0,0]
["JultoSep11MidlothianSubstantial","Midlothian","Substantial","JultoSep11",0,0,0,0,0,0,0,0,0,0,0,0]
["JultoSep11MidlothianModerate","Midlothian","Moderate","JultoSep11",0,0,0,0,0,0,0,0,0,0,0,0]
["JultoSep11MidlothianLow or No Risk","Midlothian","Low or No Risk","JultoSep11",0,0,0,0,0,0,0,0,0,0,0,0]
["JultoSep11MidlothianNot available","Midlothian","Not available","JultoSep11",0.02,0.13,0.35,0.08,0.42,1,0,0,0,0,0,0]
["JultoSep11MidlothianTotals","Midlothian","Totals","JultoSep11",0.02,0.13,0.35,0.08,0.42,1,0,0,0,0,0,0]
["JultoSep11MorayCritical","Moray","Critical","JultoSep11",0.28999999999999998,0.56999999999999995,7.0000000000000007E-2,0,7.0000000000000007E-2,1,0.05,0.85,0.05,0.04,0,1]
["JultoSep11MoraySubstantial","Moray","Substantial","JultoSep11",0.46,0.35,0.13,0.01,0.04,1,0,0.85,0.13,0.02,0,1]
["JultoSep11MorayModerate","Moray","Moderate","JultoSep11",1,0,0,0,0,1,0,1,0,0,0,1]
[{"$f":"D516&B516&C516","v":"JultoSep11MorayLow or No Risk"},"Moray","Low or No Risk","JultoSep11",0,0,0,0,0,0,0,0,0,0,0,0]
["JultoSep11MorayNot available","Moray","Not available","JultoSep11",0.48,0.28999999999999998,0.2,0.03,0,1,0.25,0.5,0.25,0,0,1]
["JultoSep11MorayTotals","Moray","Totals","JultoSep11",0.46,0.34,0.15,0.02,0.03,1,0.03,0.85,0.1,0.02,0,1]
["JultoSep11North AyrshireCritical","North Ayrshire","Critical","JultoSep11",0,0.5,0,0,0.5,1,0.6,0.4,0,0,0,1]
["JultoSep11North AyrshireSubstantial","North Ayrshire","Substantial","JultoSep11",0.16,0.26,0.26,0.12,0.21,1,0.64,0.33,0.03,0,0,1]
["JultoSep11North AyrshireModerate","North Ayrshire","Moderate","JultoSep11",0.5,0.17,0,0.17,0.17,1,0.67,0.33,0,0,0,1]
["JultoSep11North AyrshireLow or No Risk","North Ayrshire","Low or No Risk","JultoSep11",0,0,0,0,0,0,1,0,0,0,0,1]
["JultoSep11North AyrshireNot available","North Ayrshire","Not available","JultoSep11",0.38,0.24,0.19,0.14000000000000001,0.05,1,1,0,0,0,0,1]
["JultoSep11North AyrshireTotals","North Ayrshire","Totals","JultoSep11",0.24,0.26,0.2,0.12,0.18,1,0.66,0.32,0.02,0,0,1]
["JultoSep11North LanarkshireCritical","North Lanarkshire","Critical","JultoSep11",0.61,0.26,0.04,0.03,0.06,1,0.36,0.57999999999999996,0.02,0.01,0.03,1]
["JultoSep11North LanarkshireSubstantial","North Lanarkshire","Substantial","JultoSep11",0.5,0.28999999999999998,0.09,0.03,0.09,1,0.39,0.55000000000000004,0.03,0,0.03,1]
["JultoSep11North LanarkshireModerate","North Lanarkshire","Moderate","JultoSep11",0.59,0.22,0.08,0.03,7.0000000000000007E-2,1,0.32,0.63,0.04,0.02,0,1]
["JultoSep11North LanarkshireLow or No Risk","North Lanarkshire","Low or No Risk","JultoSep11",0.67,0.19,0.06,0.02,0.06,1,0.5,0.4,0,0.05,0.05,1]
["JultoSep11North LanarkshireNot available","North Lanarkshire","Not available","JultoSep11",0,0,0,0,0,0,0,0,0,0,0,0]
["JultoSep11North LanarkshireTotals","North Lanarkshire","Totals","JultoSep11",0.6,0.24,0.06,0.03,7.0000000000000007E-2,1,0.37,0.56999999999999995,0.03,0.01,0.03,1]
["JultoSep11Orkney islandsCritical","Orkney islands","Critical","JultoSep11",0,0,0,0,0,0,0,0,0,0,0,0]
["JultoSep11Orkney islandsSubstantial","Orkney islands","Substantial","JultoSep11",0,0,0,0,0,0,0,0,0,0,0,0]
["JultoSep11Orkney islandsModerate","Orkney islands","Moderate","JultoSep11",0,0,0,0,0,0,0,0,0,0,0,0]
["JultoSep11Orkney islandsLow or No Risk","Orkney islands","Low or No Risk","JultoSep11",0,0,0,0,0,0,0,0,0,0,0,0]
["JultoSep11Orkney islandsNot available","Orkney islands","Not available","JultoSep11",0,0,0,0,0,0,0,0,0,0,0,0]
["JultoSep11Orkney islandsTotals","Orkney islands","Totals","JultoSep11",0,0,0,0,0,0,0,0,0,0,0,0]
["JultoSep11Perth & KinrossCritical","Perth & Kinross","Critical","JultoSep11",0,0,0,0,0,0,0,0.33,0.33,0.33,0,1]
["JultoSep11Perth & KinrossSubstantial","Perth & Kinross","Substantial","JultoSep11",0.04,0.37,0.12,0.08,0.39,1,0,0.22,0.33,0,0.44,1]
["JultoSep11Perth & KinrossModerate","Perth & Kinross","Moderate","JultoSep11",0.01,0.21,0.11,0.04,0.63,1,0,0.31,0.08,0.15,0.46,1]
["JultoSep11Perth & KinrossLow or No Risk","Perth & Kinross","Low or No Risk","JultoSep11",0,0.18,0.18,0.09,0.55000000000000004,1,0,0.33,0,0.33,0.33,1]
["JultoSep11Perth & KinrossNot available","Perth & Kinross","Not available","JultoSep11",0.42,0,0.06,0.15,0.36,1,0,0.33,0,0,0.67,1]
["JultoSep11Perth & KinrossTotals","Perth & Kinross","Totals","JultoSep11",0.08,0.21,0.11,7.0000000000000007E-2,0.53,1,0,0.28999999999999998,0.16,0.13,0.42,1]
["JultoSep11RenfrewshireCritical","Renfrewshire","Critical","JultoSep11",0.59,0.14000000000000001,0.14000000000000001,0.09,0.05,1,0.19,0.21,0.12,0.21,0.28000000000000003,1]
["JultoSep11RenfrewshireSubstantial","Renfrewshire","Substantial","JultoSep11",0.39,0.14000000000000001,0.08,0.12,0.27,1,0.23,0.25,0.17,0.17,0.19,1]
["JultoSep11RenfrewshireModerate","Renfrewshire","Moderate","JultoSep11",0.5,0.5,0,0,0,1,0,0.75,0,0.25,0,1]
["JultoSep11RenfrewshireLow or No Risk","Renfrewshire","Low or No Risk","JultoSep11",1,0,0,0,0,1,0,0,0,0,0,0]
["JultoSep11RenfrewshireNot available","Renfrewshire","Not available","JultoSep11",0.28999999999999998,0.15,0.09,7.0000000000000007E-2,0.39,1,0.3,0.21,0.12,0.03,0.33,1]
["JultoSep11RenfrewshireTotals","Renfrewshire","Totals","JultoSep11",0.34,0.15,0.09,0.08,0.33,1,0.23,0.24,0.13,0.15,0.25,1]
["JultoSep11Scottish BordersCritical","Scottish Borders","Critical","JultoSep11",0.31,0.17,0.08,0.08,0.36,1,0.09,0.71,0.12,0.08,0,1]
["JultoSep11Scottish BordersSubstantial","Scottish Borders","Substantial","JultoSep11",0.16,0.1,0.15,0.1,0.49,1,0,0.6,0.4,0,0,1]
["JultoSep11Scottish BordersModerate","Scottish Borders","Moderate","JultoSep11",0,0.25,0,0,0.75,1,0,1,0,0,0,1]
["JultoSep11Scottish BordersLow or No Risk","Scottish Borders","Low or No Risk","JultoSep11",0.5,0,0,0.5,0,1,0,0,0,0,0,0]
["JultoSep11Scottish BordersNot available","Scottish Borders","Not available","JultoSep11",0,0,0,0,0,0,0,0,0,0,0,0]
["JultoSep11Scottish BordersTotals","Scottish Borders","Totals","JultoSep11",0.27,0.15,0.1,0.09,0.39,1,0.09,0.7,0.13,0.08,0,1]
["JultoSep11Shetland islandsCritical","Shetland islands","Critical","JultoSep11",0,0.5,0.5,0,0,1,0.18,0.73,0.09,0,0,1]
["JultoSep11Shetland islandsSubstantial","Shetland islands","Substantial","JultoSep11",0.25,0.5,0,0,0.25,1,0,1,0,0,0,1]
["JultoSep11Shetland islandsModerate","Shetland islands","Moderate","JultoSep11",0.33,0.33,0.33,0,0,1,0,1,0,0,0,1]
["JultoSep11Shetland islandsLow or No Risk","Shetland islands","Low or No Risk","JultoSep11",0,0,0,0,0,0,0,0,0,0,0,0]
["JultoSep11Shetland islandsNot available","Shetland islands","Not available","JultoSep11",0.24,0.37,0.22,0.04,0.13,1,0,1,0,0,0,1]
["JultoSep11Shetland islandsTotals","Shetland islands","Totals","JultoSep11",0.24,0.38,0.22,0.04,0.13,1,0.1,0.86,0.05,0,0,1]
["JultoSep11South AyrshireCritical","South Ayrshire","Critical","JultoSep11",0.23,0.44,0.33,0,0,1,0.6,0.25,0.15,0,0,1]
["JultoSep11South AyrshireSubstantial","South Ayrshire","Substantial","JultoSep11",0.2,0.6,0.2,0,0,1,0.2,0.65,0.15,0,0,1]
["JultoSep11South AyrshireModerate","South Ayrshire","Moderate","JultoSep11",0.18,0.53,0.28999999999999998,0,0,1,0.46,0.43,7.0000000000000007E-2,0.04,0,1]
["JultoSep11South AyrshireLow or No Risk","South Ayrshire","Low or No Risk","JultoSep11",0.22,0.48,0.3,0,0,1,0.66,0.13,0,0.22,0,1]
["JultoSep11South AyrshireNot available","South Ayrshire","Not available","JultoSep11",0,0,0,0,0,0,0,0,0,0,0,0]
["JultoSep11South AyrshireTotals","South Ayrshire","Totals","JultoSep11",0.21,0.49,0.3,0,0,1,0.53,0.32,0.1,0.06,0,1]
["JultoSep11South LanarkshireCritical","South Lanarkshire","Critical","JultoSep11",0,0,0,0,0,0,0,0,0,0,0,0]
["JultoSep11South LanarkshireSubstantial","South Lanarkshire","Substantial","JultoSep11",0,0,0,0,0,0,0,0,0,0,0,0]
["JultoSep11South LanarkshireModerate","South Lanarkshire","Moderate","JultoSep11",0,0,0,0,0,0,0,0,0,0,0,0]
["JultoSep11South LanarkshireLow or No Risk","South Lanarkshire","Low or No Risk","JultoSep11",0,0,0,0,0,0,0,0,0,0,0,0]
["JultoSep11South LanarkshireNot available","South Lanarkshire","Not available","JultoSep11",0,0,0,0,0,0,0,0,0,0,0,0]
["JultoSep11South LanarkshireTotals","South Lanarkshire","Totals","JultoSep11",0,0,0,0,0,0,0,0,0,0,0,0]
["JultoSep11StirlingCritical","Stirling","Critical","JultoSep11",0.71,0.18,0.05,0.06,0,1,0,0.74,0.16,0.1,0,1]
["JultoSep11StirlingSubstantial","Stirling","Substantial","JultoSep11",0.34,0.26,0.05,0.06,0.3,1,0.11,0.57999999999999996,0.26,0.05,0,1]
["JultoSep11StirlingModerate","Stirling","Moderate","JultoSep11",0,0.11,0,0,0.89,1,0,0,0,0,1,1]
["JultoSep11StirlingLow or No Risk","Stirling","Low or No Risk","JultoSep11",0,0,0,0,0,0,0,0,0,0,0,0]
["JultoSep11StirlingNot available","Stirling","Not available","JultoSep11",0.22,0.31,0.11,0.03,0.34,1,0.38,0.33,0.24,0.05,0,1]
["JultoSep11StirlingTotals","Stirling","Totals","JultoSep11",0.39,0.25,0.06,0.05,0.25,1,0.14000000000000001,0.56999999999999995,0.21,7.0000000000000007E-2,0.01,1]
["JultoSep11West DunbartonshireCritical","West Dunbartonshire","Critical","JultoSep11",0.79,0.21,0,0,0,1,0.93,0.08,0,0,0,1]
[{"$f":"D580&B580&C580","v":"JultoSep11West DunbartonshireSubstantial"},"West Dunbartonshire","Substantial","JultoSep11",0,0.85,0.15,0,0,1,0,1,0,0,0,1]
["JultoSep11West DunbartonshireModerate","West Dunbartonshire","Moderate","JultoSep11",0,0,0.69,0.28999999999999998,0.03,1,0,0,1,0,0,1]
["JultoSep11West DunbartonshireLow or No Risk","West Dunbartonshire","Low or No Risk","JultoSep11",0,0,0,0,1,1,0,0,0,0.25,0.75,1]
["JultoSep11West DunbartonshireNot available","West Dunbartonshire","Not available","JultoSep11",0,0,0,0,0,0,0,0,0,0,0,0]
["JultoSep11West DunbartonshireTotals","West Dunbartonshire","Totals","JultoSep11",0.13,0.47,0.28000000000000003,0.09,0.03,1,0.45,0.44,0.06,0.01,0.04,1]
["JultoSep11West LothianCritical","West Lothian","Critical","JultoSep11",0.2,0.48,0.11,0.09,0.11,1,0.23,0.55000000000000004,0.14000000000000001,0.03,0.05,1]
["JultoSep11West LothianSubstantial","West Lothian","Substantial","JultoSep11",0,0.28999999999999998,0.18,0.44,0.09,1,0.35,0.38,0.1,0.1,0.06,1]
["JultoSep11West LothianModerate","West Lothian","Moderate","JultoSep11",0.05,0.2,0.25,0.05,0.45,1,0.35,0.45,0.13,0.06,0,1]
["JultoSep11West LothianLow or No Risk","West Lothian","Low or No Risk","JultoSep11",0.09,0.09,0,0.45,0.36,1,0.83,0,0,0.17,0,1]
["JultoSep11West LothianNot available","West Lothian","Not available","JultoSep11",0.2,0.4,0,0.27,0.13,1,0,0,0,0,0,0]
["JultoSep11West LothianTotals","West Lothian","Totals","JultoSep11",0.11,0.34,0.13,0.23,0.19,1,0.31,0.47,0.12,0.06,0.04,1]
["JultoSep11SCOTLAND TOTALSCritical","SCOTLAND TOTALS","Critical","JultoSep11",0.35,0.27,0.13,7.0000000000000007E-2,0.18,1,0.33,0.51,0.08,0.04,0.04,1]
["JultoSep11SCOTLAND TOTALSSubstantial","SCOTLAND TOTALS","Substantial","JultoSep11",0.25,0.25,0.15,0.1,0.25,1,0.19,0.69,0.06,0.04,0.02,1]
["JultoSep11SCOTLAND TOTALSModerate","SCOTLAND TOTALS","Moderate","JultoSep11",0.17,0.22,0.15,0.08,0.39,1,0.17,0.64,0.1,0.06,0.04,1]
["JultoSep11SCOTLAND TOTALSLow or No Risk","SCOTLAND TOTALS","Low or No Risk","JultoSep11",0.31,0.27,0.14000000000000001,7.0000000000000007E-2,0.21,1,0.27,0.62,0.01,7.0000000000000007E-2,0.03,1]
["JultoSep11SCOTLAND TOTALSNot available","SCOTLAND TOTALS","Not available","JultoSep11",0.17,0.25,0.2,0.13,0.24,1,0.12,0.64,0.12,0.08,0.04,1]
["JultoSep11SCOTLAND TOTALSTotals","SCOTLAND TOTALS","Totals","JultoSep11",0.23,0.25,0.17,0.1,0.25,1,0.2,0.63,0.08,0.05,0.03,1]
["OcttoDec11Aberdeen CityCritical","Aberdeen City","Critical","OcttoDec11",0.3,0.43,0.17,0.09,0,1,0.33,0.67,0,0,0,1]
["OcttoDec11Aberdeen CitySubstantial","Aberdeen City","Substantial","OcttoDec11",0.31,0.25,0.28999999999999998,0.03,0.12,1,0.08,0.64,0.19,0.08,0,1]
["OcttoDec11Aberdeen CityModerate","Aberdeen City","Moderate","OcttoDec11",0.13,0.13,0.13,0.5,0.13,1,0,0.5,0.5,0,0,1]
["OcttoDec11Aberdeen CityLow or No Risk","Aberdeen City","Low or No Risk","OcttoDec11",0.5,0,0,0,0.5,1,0,0,0,0,0,0]
["OcttoDec11Aberdeen CityNot available","Aberdeen City","Not available","OcttoDec11",0,0,0,0,0,0,0,0,0,0,0,0]
["OcttoDec11Aberdeen CityTotals","Aberdeen City","Totals","OcttoDec11",0.28999999999999998,0.28000000000000003,0.24,0.09,0.1,1,0.13,0.63,0.17,0.06,0,1]
["OcttoDec11AberdeenshireCritical","Aberdeenshire","Critical","OcttoDec11",0,0.5,0,0.5,0,1,0,0,0,0,0,0]
["OcttoDec11AberdeenshireSubstantial","Aberdeenshire","Substantial","OcttoDec11",0.33,0,0.33,0,0.33,1,0,0,0,0,0,0]
["OcttoDec11AberdeenshireModerate","Aberdeenshire","Moderate","OcttoDec11",0,0.38,0.13,0.13,0.38,1,0,0,0,0,0,0]
["OcttoDec11AberdeenshireLow or No Risk","Aberdeenshire","Low or No Risk","OcttoDec11",0.04,0.64,0.08,0.12,0.12,1,0,0,0,0,0,0]
["OcttoDec11AberdeenshireNot available","Aberdeenshire","Not available","OcttoDec11",0.11,0.38,0.19,7.0000000000000007E-2,0.26,1,0,0,0,0,0,0]
["OcttoDec11AberdeenshireTotals","Aberdeenshire","Totals","OcttoDec11",0.1,0.41,0.17,0.08,0.24,1,0,0,0,0,0,0]
["OcttoDec11AngusCritical","Angus","Critical","OcttoDec11",0.05,0.11,0.16,0.26,0.42,1,0.41,0.38,0.13,0.06,0.03,1]
["OcttoDec11AngusSubstantial","Angus","Substantial","OcttoDec11",0.51,0.08,0.13,0.13,0.15,1,0.13,0.78,0.05,0.01,0.03,1]
["OcttoDec11AngusModerate","Angus","Moderate","OcttoDec11",0.37,0.09,0.02,0.14000000000000001,0.37,1,0.18,0.66,0.08,0.05,0.03,1]
["OcttoDec11AngusLow or No Risk","Angus","Low or No Risk","OcttoDec11",0.4,0.13,0.25,0.08,0.15,1,0,0.98,0,0.02,0,1]
["OcttoDec11AngusNot available","Angus","Not available","OcttoDec11",0,0,0,0,0,0,0,0,0,0,0,0]
["OcttoDec11AngusTotals","Angus","Totals","OcttoDec11",0.38,0.1,0.14000000000000001,0.13,0.25,1,0.15,0.75,0.05,0.03,0.02,1]
["OcttoDec11Argyll & ButeCritical","Argyll & Bute","Critical","OcttoDec11",0.09,0.4,0.19,0.11,0.21,1,0.24,0.44,0.1,0.02,0.2,1]
["OcttoDec11Argyll & ButeSubstantial","Argyll & Bute","Substantial","OcttoDec11",0.13,0.22,0.12,0.13,0.4,1,0.14000000000000001,0.38,7.0000000000000007E-2,0.1,0.31,1]
["OcttoDec11Argyll & ButeModerate","Argyll & Bute","Moderate","OcttoDec11",0.13,0.38,0.25,0.13,0.13,1,0,1,0,0,0,1]
["OcttoDec11Argyll & ButeLow or No Risk","Argyll & Bute","Low or No Risk","OcttoDec11",0.33,0,0,0,0.67,1,0,0,0,0,0,0]
["OcttoDec11Argyll & ButeNot available","Argyll & Bute","Not available","OcttoDec11",0,0,0,0,0,0,0,0,0,0,0,0]
["OcttoDec11Argyll & ButeTotals","Argyll & Bute","Totals","OcttoDec11",0.12,0.28000000000000003,0.15,0.12,0.33,1,0.19,0.42,0.08,0.06,0.25,1]
["OcttoDec11ClackmannanshireCritical","Clackmannanshire","Critical","OcttoDec11",0,0,0,0,0,0,0,0,0,0,0,0]
["OcttoDec11ClackmannanshireSubstantial","Clackmannanshire","Substantial","OcttoDec11",7.0000000000000007E-2,0.53,0.13,0.2,7.0000000000000007E-2,1,0,0,0,0,0,0]
["OcttoDec11ClackmannanshireModerate","Clackmannanshire","Moderate","OcttoDec11",0,0.35,0.18,0.15,0.33,1,0,0,0,0,0,0]
["OcttoDec11ClackmannanshireLow or No Risk","Clackmannanshire","Low or No Risk","OcttoDec11",0,0.11,0.09,0.11,0.69,1,0,0,0,0,0,0]
["OcttoDec11ClackmannanshireNot available","Clackmannanshire","Not available","OcttoDec11",0,0,0,0,0,0,0.5,0.46,0.04,0,0,1]
["OcttoDec11ClackmannanshireTotals","Clackmannanshire","Totals","OcttoDec11",0.01,0.28999999999999998,0.13,0.14000000000000001,0.42,1,0.5,0.46,0.04,0,0,1]
["OcttoDec11Dumfries and GallowayCritical","Dumfries and Galloway","Critical","OcttoDec11",0,0,0,0,0,0,0,0,0,0,0,0]
["OcttoDec11Dumfries and GallowaySubstantial","Dumfries and Galloway","Substantial","OcttoDec11",0,0,0,0,0,0,0,0,0,0,0,0]
["OcttoDec11Dumfries and GallowayModerate","Dumfries and Galloway","Moderate","OcttoDec11",0,0,0,0,0,0,0,0,0,0,0,0]
["OcttoDec11Dumfries and GallowayLow or No Risk","Dumfries and Galloway","Low or No Risk","OcttoDec11",0,0,0,0,0,0,0,0,0,0,0,0]
["OcttoDec11Dumfries and GallowayNot available","Dumfries and Galloway","Not available","OcttoDec11",0.46,0.48,0.03,0.01,0.01,1,7.0000000000000007E-2,0.75,0.13,0.04,0.01,1]
["OcttoDec11Dumfries and GallowayTotals","Dumfries and Galloway","Totals","OcttoDec11",0.46,0.48,0.03,0.01,0.01,1,7.0000000000000007E-2,0.75,0.13,0.04,0.01,1]
["OcttoDec11Dundee CityCritical","Dundee City","Critical","OcttoDec11",0.23,0.41,0.18,0.14000000000000001,0.05,1,0.27,0.48,0.12,0.13,0,1]
["OcttoDec11Dundee CitySubstantial","Dundee City","Substantial","OcttoDec11",7.0000000000000007E-2,0.33,0.18,7.0000000000000007E-2,0.36,1,0.24,0.56000000000000005,0.12,7.0000000000000007E-2,0,1]
["OcttoDec11Dundee CityModerate","Dundee City","Moderate","OcttoDec11",7.0000000000000007E-2,0.24,0.14000000000000001,0.15,0.4,1,0.19,0.69,0.12,0,0,1]
["OcttoDec11Dundee CityLow or No Risk","Dundee City","Low or No Risk","OcttoDec11",0.09,0.22,0.06,0.06,0.56000000000000005,1,0.17,0.83,0,0,0,1]
["OcttoDec11Dundee CityNot available","Dundee City","Not available","OcttoDec11",0,0,0,1,0,1,0,0,0,0,0,0]
["OcttoDec11Dundee CityTotals","Dundee City","Totals","OcttoDec11",0.09,0.27,0.14000000000000001,0.12,0.38,1,0.23,0.57999999999999996,0.11,7.0000000000000007E-2,0,1]
["OcttoDec11East AyrshireCritical","East Ayrshire","Critical","OcttoDec11",0.52,0.3,0.15,0,0.04,1,0.71,0.04,0.17,0.08,0,1]
["OcttoDec11East AyrshireSubstantial","East Ayrshire","Substantial","OcttoDec11",0.25,0.25,0.25,0.17,0.08,1,0.47,0.27,0.2,7.0000000000000007E-2,0,1]
["OcttoDec11East AyrshireModerate","East Ayrshire","Moderate","OcttoDec11",0.28999999999999998,0.26,0.28999999999999998,7.0000000000000007E-2,0.1,1,0.56999999999999995,0.26,0.13,0.04,0,1]
["OcttoDec11East AyrshireLow or No Risk","East Ayrshire","Low or No Risk","OcttoDec11",0.38,0.44,0.13,0.03,0.03,1,1,0,0,0,0,1]
["OcttoDec11East AyrshireNot available","East Ayrshire","Not available","OcttoDec11",0,0,0,0,0,0,0.44,0.5,0.06,0,0,1]
[{"$f":"D644&B644&C644","v":"OcttoDec11East AyrshireTotals"},"East Ayrshire","Totals","OcttoDec11",0.36,0.32,0.2,0.05,0.06,1,0.57999999999999996,0.24,0.14000000000000001,0.05,0,1]
["OcttoDec11East DunbartonshireCritical","East Dunbartonshire","Critical","OcttoDec11",0,1,0,0,0,1,0,1,0,0,0,1]
["OcttoDec11East DunbartonshireSubstantial","East Dunbartonshire","Substantial","OcttoDec11",0.74,0.16,0.04,0.05,0.01,1,0,0.95,0.03,0.01,0.01,1]
["OcttoDec11East DunbartonshireModerate","East Dunbartonshire","Moderate","OcttoDec11",0.2,0.11,0.22,0.33,0.13,1,0,0.8,7.0000000000000007E-2,0,0.13,1]
["OcttoDec11East DunbartonshireLow or No Risk","East Dunbartonshire","Low or No Risk","OcttoDec11",0.33,0.08,0.08,0.5,0,1,0,0.9,0.1,0,0,1]
["OcttoDec11East DunbartonshireNot available","East Dunbartonshire","Not available","OcttoDec11",0.75,0,0,0,0.25,1,0,0,0,0,0,0]
["OcttoDec11East DunbartonshireTotals","East Dunbartonshire","Totals","OcttoDec11",0.56999999999999995,0.14000000000000001,0.09,0.16,0.04,1,0,0.94,0.04,0,0.02,1]
["OcttoDec11East LothianCritical","East Lothian","Critical","OcttoDec11",0,0,0,0,0,0,0,0.6,0.4,0,0,1]
["OcttoDec11East LothianSubstantial","East Lothian","Substantial","OcttoDec11",0.32,0.44,0.14000000000000001,0.03,7.0000000000000007E-2,1,0.5,0.36,0.1,0.02,0.01,1]
["OcttoDec11East LothianModerate","East Lothian","Moderate","OcttoDec11",0,0,0,0,0,0,0,0,0,0,0,0]
["OcttoDec11East LothianLow or No Risk","East Lothian","Low or No Risk","OcttoDec11",0,0,0,0,0,0,0,0,0,0,0,0]
["OcttoDec11East LothianNot available","East Lothian","Not available","OcttoDec11",0,0,0,0,0,0,0,0,0,0,0,0]
["OcttoDec11East LothianTotals","East Lothian","Totals","OcttoDec11",0.32,0.44,0.14000000000000001,0.03,7.0000000000000007E-2,1,0.49,0.37,0.11,0.02,0.01,1]
["OcttoDec11East RenfrewshireCritical","East Renfrewshire","Critical","OcttoDec11",0.34,0.57999999999999996,0.02,0.03,0.03,1,0,0.95,0.03,0.02,0,1]
["OcttoDec11East RenfrewshireSubstantial","East Renfrewshire","Substantial","OcttoDec11",0.22,0.56000000000000005,0.11,0.11,0,1,0,0.78,0,0.22,0,1]
["OcttoDec11East RenfrewshireModerate","East Renfrewshire","Moderate","OcttoDec11",0.25,0.75,0,0,0,1,0,0.75,0,0.25,0,1]
["OcttoDec11East RenfrewshireLow or No Risk","East Renfrewshire","Low or No Risk","OcttoDec11",0,0,0,0,0,0,0,0,0,0,0,0]
["OcttoDec11East RenfrewshireNot available","East Renfrewshire","Not available","OcttoDec11",0.28999999999999998,0.68,0.03,0,0,1,0,1,0,0,0,1]
["OcttoDec11East RenfrewshireTotals","East Renfrewshire","Totals","OcttoDec11",0.31,0.61,0.03,0.03,0.02,1,0,0.94,0.02,0.04,0,1]
["OcttoDec11Edinburgh, City ofCritical","Edinburgh, City of","Critical","OcttoDec11",0,0,0,0,0,0,0,0,0,0,0,0]
["OcttoDec11Edinburgh, City ofSubstantial","Edinburgh, City of","Substantial","OcttoDec11",0,0,0,0,0,0,0,0,0,0,0,0]
["OcttoDec11Edinburgh, City ofModerate","Edinburgh, City of","Moderate","OcttoDec11",0,0,0,0,0,0,0,0,0,0,0,0]
["OcttoDec11Edinburgh, City ofLow or No Risk","Edinburgh, City of","Low or No Risk","OcttoDec11",0,0,0,0,0,0,0,0,0,0,0,0]
["OcttoDec11Edinburgh, City ofNot available","Edinburgh, City of","Not available","OcttoDec11",0.1,0.15,0.2,0.26,0.28999999999999998,1,0.1,0.65,0.12,0.06,7.0000000000000007E-2,1]
["OcttoDec11Edinburgh, City ofTotals","Edinburgh, City of","Totals","OcttoDec11",0.1,0.15,0.2,0.26,0.28999999999999998,1,0.1,0.65,0.12,0.06,7.0000000000000007E-2,1]
["OcttoDec11Eilean SiarCritical","Eilean Siar","Critical","OcttoDec11",0,0,0,0,0,0,0,0,0,0,0,0]
["OcttoDec11Eilean SiarSubstantial","Eilean Siar","Substantial","OcttoDec11",0,0,0,0,0,0,0,0,0,0,0,0]
["OcttoDec11Eilean SiarModerate","Eilean Siar","Moderate","OcttoDec11",0,0,0,0,0,0,0,0,0,0,0,0]
["OcttoDec11Eilean SiarLow or No Risk","Eilean Siar","Low or No Risk","OcttoDec11",0,0,0,0,0,0,0,0,0,0,0,0]
["OcttoDec11Eilean SiarNot available","Eilean Siar","Not available","OcttoDec11",0,0,0,0,0,0,0,0,0,0,0,0]
["OcttoDec11Eilean SiarTotals","Eilean Siar","Totals","OcttoDec11",0,0,0,0,0,0,0,0,0,0,0,0]
["OcttoDec11FalkirkCritical","Falkirk","Critical","OcttoDec11",0.49,0.32,0.11,0.02,0.06,1,0.83,0.14000000000000001,0.02,0,0.01,1]
["OcttoDec11FalkirkSubstantial","Falkirk","Substantial","OcttoDec11",0.17,0.32,0.17,0.13,0.21,1,0.71,0.23,0.04,0.02,0,1]
["OcttoDec11FalkirkModerate","Falkirk","Moderate","OcttoDec11",0.19,0.19,0.5,0.08,0.04,1,0.5,0.5,0,0,0,1]
["OcttoDec11FalkirkLow or No Risk","Falkirk","Low or No Risk","OcttoDec11",0.33,0,0.33,0,0.33,1,0,0,0,0,0,0]
["OcttoDec11FalkirkNot available","Falkirk","Not available","OcttoDec11",0,0,0,0,0,0,0.56999999999999995,0.43,0,0,0,1]
["OcttoDec11FalkirkTotals","Falkirk","Totals","OcttoDec11",0.27,0.28999999999999998,0.21,0.09,0.14000000000000001,1,0.77,0.19,0.02,0.01,0.01,1]
["OcttoDec11FifeCritical","Fife","Critical","OcttoDec11",0.12,0.41,0.2,0.17,0.1,1,0,0.87,7.0000000000000007E-2,0,7.0000000000000007E-2,1]
["OcttoDec11FifeSubstantial","Fife","Substantial","OcttoDec11",0.09,0.31,0.23,0.11,0.25,1,0.05,0.61,0.26,0.03,0.05,1]
["OcttoDec11FifeModerate","Fife","Moderate","OcttoDec11",0,0.53,0.2,0.13,0.13,1,0.2,0.4,0.2,0.2,0,1]
["OcttoDec11FifeLow or No Risk","Fife","Low or No Risk","OcttoDec11",0,0,0,0.5,0.5,1,0,0,0,0,0,0]
["OcttoDec11FifeNot available","Fife","Not available","OcttoDec11",0.06,0.21,0.2,0.18,0.35,1,0.1,0.6,0.1,0.1,0.1,1]
["OcttoDec11FifeTotals","Fife","Totals","OcttoDec11",7.0000000000000007E-2,0.25,0.21,0.16,0.31,1,0.05,0.65,0.21,0.03,0.06,1]
["OcttoDec11Glasgow CityCritical","Glasgow City","Critical","OcttoDec11",0.05,0.22,0.18,0.1,0.45,1,0,1,0,0,0,1]
["OcttoDec11Glasgow CitySubstantial","Glasgow City","Substantial","OcttoDec11",0.11,0.16,0.17,0.1,0.46,1,0,1,0,0,0,1]
["OcttoDec11Glasgow CityModerate","Glasgow City","Moderate","OcttoDec11",7.0000000000000007E-2,0.1,0.13,0.05,0.65,1,0,1,0,0,0,1]
["OcttoDec11Glasgow CityLow or No Risk","Glasgow City","Low or No Risk","OcttoDec11",0.17,0.22,0.17,0.06,0.39,1,0,1,0,0,0,1]
["OcttoDec11Glasgow CityNot available","Glasgow City","Not available","OcttoDec11",0.19,0.21,0.15,7.0000000000000007E-2,0.37,1,0,1,0,0,0,1]
["OcttoDec11Glasgow CityTotals","Glasgow City","Totals","OcttoDec11",0.11,0.17,0.16,0.08,0.48,1,0,1,0,0,0,1]
["OcttoDec11HighlandCritical","Highland","Critical","OcttoDec11",0.15,0.31,0.16,0.11,0.26,1,0,0,0,0,0,0]
["OcttoDec11HighlandSubstantial","Highland","Substantial","OcttoDec11",0.1,0.17,0.24,0.15,0.35,1,0,0,0,0,0,0]
["OcttoDec11HighlandModerate","Highland","Moderate","OcttoDec11",0.03,0.28999999999999998,0.19,0.15,0.34,1,0,0,0,0,0,0]
["OcttoDec11HighlandLow or No Risk","Highland","Low or No Risk","OcttoDec11",0,0,0,0,1,1,0,0,0,0,0,0]
["OcttoDec11HighlandNot available","Highland","Not available","OcttoDec11",0.06,0.22,0.22,0.15,0.35,1,0,0,0,0,0,0]
["OcttoDec11HighlandTotals","Highland","Totals","OcttoDec11",0.08,0.25,0.2,0.14000000000000001,0.33,1,0,0,0,0,0,0]
["OcttoDec11InverclydeCritical","Inverclyde","Critical","OcttoDec11",0.16,0.37,0.21,0.11,0.16,1,0.45,0.26,0.15,0.11,0.04,1]
["OcttoDec11InverclydeSubstantial","Inverclyde","Substantial","OcttoDec11",0.04,0.62,0.15,0.12,0.08,1,0.63,0.27,0.05,0.02,0.03,1]
["OcttoDec11InverclydeModerate","Inverclyde","Moderate","OcttoDec11",0.05,0.38,0.38,0.05,0.14000000000000001,1,0.24,0.18,0.18,0.06,0.35,1]
["OcttoDec11InverclydeLow or No Risk","Inverclyde","Low or No Risk","OcttoDec11",0,0.27,0.36,0.18,0.18,1,0.25,0.25,0.25,0,0.25,1]
["OcttoDec11InverclydeNot available","Inverclyde","Not available","OcttoDec11",0.5,0.5,0,0,0,1,1,0,0,0,0,1]
["OcttoDec11InverclydeTotals","Inverclyde","Totals","OcttoDec11",0.08,0.44,0.25,0.1,0.13,1,0.51,0.25,0.11,0.05,0.08,1]
["OcttoDec11MidlothianCritical","Midlothian","Critical","OcttoDec11",0,0,0,0,0,0,0,0,0,0,0,0]
["OcttoDec11MidlothianSubstantial","Midlothian","Substantial","OcttoDec11",0,0,0,0,0,0,0,0,0,0,0,0]
["OcttoDec11MidlothianModerate","Midlothian","Moderate","OcttoDec11",0,0,0,0,0,0,0,0,0,0,0,0]
[{"$f":"D708&B708&C708","v":"OcttoDec11MidlothianLow or No Risk"},"Midlothian","Low or No Risk","OcttoDec11",0,0,0,0,0,0,0,0,0,0,0,0]
["OcttoDec11MidlothianNot available","Midlothian","Not available","OcttoDec11",0.01,0.19,0.32,0.09,0.39,1,0,0,0,0,0,0]
["OcttoDec11MidlothianTotals","Midlothian","Totals","OcttoDec11",0.01,0.19,0.32,0.09,0.39,1,0,0,0,0,0,0]
["OcttoDec11MorayCritical","Moray","Critical","OcttoDec11",0.57999999999999996,0.21,0.21,0,0,1,0.13,0.88,0,0,0,1]
["OcttoDec11MoraySubstantial","Moray","Substantial","OcttoDec11",0.49,0.34,0.17,0,0,1,0.06,0.85,0.06,0.02,0,1]
["OcttoDec11MorayModerate","Moray","Moderate","OcttoDec11",0.5,0,0.5,0,0,1,0,1,0,0,0,1]
["OcttoDec11MorayLow or No Risk","Moray","Low or No Risk","OcttoDec11",0,0,0,0,0,0,0,0,0,0,0,0]
["OcttoDec11MorayNot available","Moray","Not available","OcttoDec11",0.6,0.23,0.18,0,0,1,0.08,0.77,0.15,0,0,1]
["OcttoDec11MorayTotals","Moray","Totals","OcttoDec11",0.54,0.28000000000000003,0.18,0,0,1,7.0000000000000007E-2,0.85,0.06,0.02,0,1]
["OcttoDec11North AyrshireCritical","North Ayrshire","Critical","OcttoDec11",0.11,0.22,0.33,0,0.33,1,0.5,0.38,0.13,0,0,1]
["OcttoDec11North AyrshireSubstantial","North Ayrshire","Substantial","OcttoDec11",0.19,0.19,0.27,0.21,0.15,1,0.63,0.32,0.03,0,0.03,1]
["OcttoDec11North AyrshireModerate","North Ayrshire","Moderate","OcttoDec11",0.06,0.22,0.22,0.11,0.39,1,0.7,0.3,0,0,0,1]
["OcttoDec11North AyrshireLow or No Risk","North Ayrshire","Low or No Risk","OcttoDec11",0.13,0.5,0.25,0,0.13,1,0.5,0.5,0,0,0,1]
["OcttoDec11North AyrshireNot available","North Ayrshire","Not available","OcttoDec11",0.1,0.28999999999999998,0.43,0.19,0,1,0,0,0,0,0,0]
["OcttoDec11North AyrshireTotals","North Ayrshire","Totals","OcttoDec11",0.13,0.24,0.3,0.15,0.17,1,0.62,0.33,0.03,0,0.02,1]
["OcttoDec11North LanarkshireCritical","North Lanarkshire","Critical","OcttoDec11",0.63,0.23,0.04,0.04,0.06,1,0.27,0.67,0.03,0.01,0.02,1]
["OcttoDec11North LanarkshireSubstantial","North Lanarkshire","Substantial","OcttoDec11",0.52,0.25,0.09,0.03,0.1,1,0.4,0.49,0.08,0.01,0.01,1]
["OcttoDec11North LanarkshireModerate","North Lanarkshire","Moderate","OcttoDec11",0.49,0.23,7.0000000000000007E-2,0.04,0.17,1,0.42,0.38,0.06,0.06,0.09,1]
["OcttoDec11North LanarkshireLow or No Risk","North Lanarkshire","Low or No Risk","OcttoDec11",0.67,0.16,0.09,0.03,0.04,1,0.19,0.62,0.08,0.04,0.08,1]
["OcttoDec11North LanarkshireNot available","North Lanarkshire","Not available","OcttoDec11",0,0,0,0,0,0,0,0,0,0,0,0]
["OcttoDec11North LanarkshireTotals","North Lanarkshire","Totals","OcttoDec11",0.59,0.22,7.0000000000000007E-2,0.04,0.09,1,0.31,0.57999999999999996,0.05,0.02,0.03,1]
["OcttoDec11Orkney islandsCritical","Orkney islands","Critical","OcttoDec11",0,0,0,0,0,0,0,0,0,0,0,0]
["OcttoDec11Orkney islandsSubstantial","Orkney islands","Substantial","OcttoDec11",0,0,0,0,0,0,0,0,0,0,0,0]
["OcttoDec11Orkney islandsModerate","Orkney islands","Moderate","OcttoDec11",0,0,0,0,0,0,0,0,0,0,0,0]
["OcttoDec11Orkney islandsLow or No Risk","Orkney islands","Low or No Risk","OcttoDec11",0,0,0,0,0,0,0,0,0,0,0,0]
["OcttoDec11Orkney islandsNot available","Orkney islands","Not available","OcttoDec11",0,0,0,0,0,0,0,0,0,0,0,0]
["OcttoDec11Orkney islandsTotals","Orkney islands","Totals","OcttoDec11",0,0,0,0,0,0,0,0,0,0,0,0]
["OcttoDec11Perth & KinrossCritical","Perth & Kinross","Critical","OcttoDec11",0,0,0,0,0,0,0,0.4,0.2,0.4,0,1]
["OcttoDec11Perth & KinrossSubstantial","Perth & Kinross","Substantial","OcttoDec11",0.05,0.32,0.08,7.0000000000000007E-2,0.47,1,0,0.25,0.25,0.13,0.38,1]
["OcttoDec11Perth & KinrossModerate","Perth & Kinross","Moderate","OcttoDec11",0.01,0.17,0.13,0.09,0.61,1,0,0,0.2,0.2,0.6,1]
["OcttoDec11Perth & KinrossLow or No Risk","Perth & Kinross","Low or No Risk","OcttoDec11",0.04,0.13,0.13,0.09,0.61,1,0,0,0.5,0,0.5,1]
["OcttoDec11Perth & KinrossNot available","Perth & Kinross","Not available","OcttoDec11",0.04,0.17,0.13,0.13,0.54,1,0,0,0.5,0,0.5,1]
["OcttoDec11Perth & KinrossTotals","Perth & Kinross","Totals","OcttoDec11",0.03,0.21,0.11,0.09,0.56000000000000005,1,0,0.18,0.27,0.18,0.36,1]
["OcttoDec11RenfrewshireCritical","Renfrewshire","Critical","OcttoDec11",0.69,0.15,0.08,0,0.08,1,0.42,0.25,0.18,0.09,7.0000000000000007E-2,1]
["OcttoDec11RenfrewshireSubstantial","Renfrewshire","Substantial","OcttoDec11",0.47,0.09,0.12,0.09,0.24,1,0.48,0.15,0.19,0.11,7.0000000000000007E-2,1]
["OcttoDec11RenfrewshireModerate","Renfrewshire","Moderate","OcttoDec11",0.6,0.2,0,0,0.2,1,0.5,0,0,0,0.5,1]
["OcttoDec11RenfrewshireLow or No Risk","Renfrewshire","Low or No Risk","OcttoDec11",0.13,0.25,0,0,0.63,1,1,0,0,0,0,1]
["OcttoDec11RenfrewshireNot available","Renfrewshire","Not available","OcttoDec11",0.38,0.08,0.05,0.04,0.44,1,0.56000000000000005,0.14000000000000001,0.06,0.08,0.16,1]
["OcttoDec11RenfrewshireTotals","Renfrewshire","Totals","OcttoDec11",0.42,0.09,0.06,0.04,0.38,1,0.5,0.18,0.13,0.09,0.11,1]
["OcttoDec11Scottish BordersCritical","Scottish Borders","Critical","OcttoDec11",0.22,0.27,0.18,0.06,0.26,1,0.06,0.69,0.11,0.11,0.04,1]
["OcttoDec11Scottish BordersSubstantial","Scottish Borders","Substantial","OcttoDec11",0.04,0.16,0.12,0.1,0.57999999999999996,1,0,0.75,0,0,0.25,1]
["OcttoDec11Scottish BordersModerate","Scottish Borders","Moderate","OcttoDec11",0,0.2,0,0.2,0.6,1,0,1,0,0,0,1]
["OcttoDec11Scottish BordersLow or No Risk","Scottish Borders","Low or No Risk","OcttoDec11",0,0,0.6,0,0.4,1,0,0,0,0,0,0]
["OcttoDec11Scottish BordersNot available","Scottish Borders","Not available","OcttoDec11",0,0,0,0,0,0,0,0,0,0,0,0]
["OcttoDec11Scottish BordersTotals","Scottish Borders","Totals","OcttoDec11",0.18,0.24,0.18,7.0000000000000007E-2,0.33,1,0.06,0.7,0.1,0.1,0.04,1]
["OcttoDec11Shetland islandsCritical","Shetland islands","Critical","OcttoDec11",0,0.33,0.33,0,0.33,1,0.2,0.6,0.2,0,0,1]
["OcttoDec11Shetland islandsSubstantial","Shetland islands","Substantial","OcttoDec11",0.33,0.67,0,0,0,1,0.1,0.6,0.3,0,0,1]
["OcttoDec11Shetland islandsModerate","Shetland islands","Moderate","OcttoDec11",0,1,0,0,0,1,0.2,0.8,0,0,0,1]
["OcttoDec11Shetland islandsLow or No Risk","Shetland islands","Low or No Risk","OcttoDec11",0,0,0,0,0,0,0,0,0,0,0,0]
["OcttoDec11Shetland islandsNot available","Shetland islands","Not available","OcttoDec11",0.14000000000000001,0.38,0.16,0.16,0.16,1,0.33,0.67,0,0,0,1]
["OcttoDec11Shetland islandsTotals","Shetland islands","Totals","OcttoDec11",0.14000000000000001,0.4,0.16,0.14000000000000001,0.16,1,0.17,0.65,0.17,0,0,1]
["OcttoDec11South AyrshireCritical","South Ayrshire","Critical","OcttoDec11",0.2,0.28999999999999998,0.51,0,0,1,0.59,0.24,0.16,0,0,1]
["OcttoDec11South AyrshireSubstantial","South Ayrshire","Substantial","OcttoDec11",0.27,0.36,0.27,0.09,0,1,0.21,0.64,0.14000000000000001,0,0,1]
["OcttoDec11South AyrshireModerate","South Ayrshire","Moderate","OcttoDec11",0.21,0.41,0.26,0.09,0.03,1,0.45,0.36,0.14000000000000001,0.05,0,1]
["OcttoDec11South AyrshireLow or No Risk","South Ayrshire","Low or No Risk","OcttoDec11",0.18,0.46,0.23,0.09,0.04,1,0.65,0.22,0.13,0,0,1]
["OcttoDec11South AyrshireNot available","South Ayrshire","Not available","OcttoDec11",0,0,0,0,0,0,0,0,0,0,0,0]
["OcttoDec11South AyrshireTotals","South Ayrshire","Totals","OcttoDec11",0.19,0.41,0.3,7.0000000000000007E-2,0.03,1,0.52,0.32,0.15,0.01,0,1]
["OcttoDec11South LanarkshireCritical","South Lanarkshire","Critical","OcttoDec11",0,0,0,0,0,0,0,0,0,0,0,0]
["OcttoDec11South LanarkshireSubstantial","South Lanarkshire","Substantial","OcttoDec11",0,0,0,0,0,0,0,0,0,0,0,0]
["OcttoDec11South LanarkshireModerate","South Lanarkshire","Moderate","OcttoDec11",0,0,0,0,0,0,0,0,0,0,0,0]
["OcttoDec11South LanarkshireLow or No Risk","South Lanarkshire","Low or No Risk","OcttoDec11",0,0,0,0,0,0,0,0,0,0,0,0]
["OcttoDec11South LanarkshireNot available","South Lanarkshire","Not available","OcttoDec11",0,0,0,0,0,0,0,0,0,0,0,0]
["OcttoDec11South LanarkshireTotals","South Lanarkshire","Totals","OcttoDec11",0,0,0,0,0,0,0,0,0,0,0,0]
["OcttoDec11StirlingCritical","Stirling","Critical","OcttoDec11",0.78,0.15,0.02,0,0.05,1,0.14000000000000001,0.72,0.14000000000000001,0,0,1]
[{"$f":"D772&B772&C772","v":"OcttoDec11StirlingSubstantial"},"Stirling","Substantial","OcttoDec11",0.38,0.14000000000000001,0.15,0.1,0.24,1,0.08,0.5,0.25,0.17,0,1]
["OcttoDec11StirlingModerate","Stirling","Moderate","OcttoDec11",0,0,0,0,1,1,0,0,0,0,0,0]
["OcttoDec11StirlingLow or No Risk","Stirling","Low or No Risk","OcttoDec11",0,0,0,0,0,0,0,0,0,0,0,0]
["OcttoDec11StirlingNot available","Stirling","Not available","OcttoDec11",0.25,0.19,0.13,0.11,0.33,1,0.32,0.63,0.05,0,0,1]
["OcttoDec11StirlingTotals","Stirling","Totals","OcttoDec11",0.43,0.15,0.1,7.0000000000000007E-2,0.25,1,0.18,0.65,0.13,0.03,0,1]
["OcttoDec11West DunbartonshireCritical","West Dunbartonshire","Critical","OcttoDec11",0.96,0.04,0,0,0,1,1,0,0,0,0,1]
["OcttoDec11West DunbartonshireSubstantial","West Dunbartonshire","Substantial","OcttoDec11",0,0.91,0.09,0,0,1,0.81,0.13,0.02,0.02,0.02,1]
["OcttoDec11West DunbartonshireModerate","West Dunbartonshire","Moderate","OcttoDec11",0,0,0.52,0.33,0.16,1,0.89,0.05,0.05,0.01,0.01,1]
["OcttoDec11West DunbartonshireLow or No Risk","West Dunbartonshire","Low or No Risk","OcttoDec11",0,0,0,0,1,1,0.97,0.03,0,0,0,1]
["OcttoDec11West DunbartonshireNot available","West Dunbartonshire","Not available","OcttoDec11",0,0,0,0,0,0,0,0,0,0,0,0]
["OcttoDec11West DunbartonshireTotals","West Dunbartonshire","Totals","OcttoDec11",0.13,0.3,0.2,0.11,0.28000000000000003,1,0.91,0.05,0.02,0.01,0.01,1]
["OcttoDec11West LothianCritical","West Lothian","Critical","OcttoDec11",0.08,0.45,0.37,0.05,0.05,1,0.14000000000000001,0.64,0.16,0.04,0.01,1]
["OcttoDec11West LothianSubstantial","West Lothian","Substantial","OcttoDec11",0.03,0.34,0.21,0.18,0.23,1,0.25,0.39,0.16,0.14000000000000001,0.06,1]
["OcttoDec11West LothianModerate","West Lothian","Moderate","OcttoDec11",0,0.16,0.18,0.32,0.34,1,0.32,0.53,0.16,0,0,1]
["OcttoDec11West LothianLow or No Risk","West Lothian","Low or No Risk","OcttoDec11",7.0000000000000007E-2,0.33,0,0.2,0.4,1,0.43,0.43,0.14000000000000001,0,0,1]
["OcttoDec11West LothianNot available","West Lothian","Not available","OcttoDec11",0,0.33,0.67,0,0,1,0.75,0.25,0,0,0,1]
["OcttoDec11West LothianTotals","West Lothian","Totals","OcttoDec11",0.04,0.32,0.23,0.18,0.23,1,0.23,0.52,0.15,7.0000000000000007E-2,0.03,1]
["OcttoDec11SCOTLAND TOTALSCritical","SCOTLAND TOTALS","Critical","OcttoDec11",0.36,0.28000000000000003,0.14000000000000001,0.06,0.16,1,0.37,0.48,0.08,0.04,0.03,1]
["OcttoDec11SCOTLAND TOTALSSubstantial","SCOTLAND TOTALS","Substantial","OcttoDec11",0.24,0.27,0.16,0.09,0.25,1,0.23,0.63,0.08,0.03,0.03,1]
["OcttoDec11SCOTLAND TOTALSModerate","SCOTLAND TOTALS","Moderate","OcttoDec11",0.14000000000000001,0.2,0.18,0.13,0.36,1,0.37,0.5,7.0000000000000007E-2,0.02,0.04,1]
["OcttoDec11SCOTLAND TOTALSLow or No Risk","SCOTLAND TOTALS","Low or No Risk","OcttoDec11",0.27,0.24,0.13,0.09,0.27,1,0.43,0.5,0.04,0.01,0.02,1]
["OcttoDec11SCOTLAND TOTALSNot available","SCOTLAND TOTALS","Not available","OcttoDec11",0.16,0.22,0.18,0.16,0.28999999999999998,1,0.17,0.65,0.09,0.04,0.05,1]
["OcttoDec11SCOTLAND TOTALSTotals","SCOTLAND TOTALS","Totals","OcttoDec11",0.21,0.24,0.16,0.11,0.27,1,0.28000000000000003,0.57999999999999996,0.08,0.03,0.03,1]
["JantoMar12Aberdeen CityCritical","Aberdeen City","Critical","JantoMar12",0.2,0.33,0.16,0.17,0.14000000000000001,1,0.27,0.73,0,0,0,1]
["JantoMar12Aberdeen CitySubstantial","Aberdeen City","Substantial","JantoMar12",0.21,0.34,0.15,0.13,0.16,1,0.23,0.54,0.23,0,0,1]
["JantoMar12Aberdeen CityModerate","Aberdeen City","Moderate","JantoMar12",0,0.4,0.2,0.2,0.2,1,0.5,0.5,0,0,0,1]
["JantoMar12Aberdeen CityLow or No Risk","Aberdeen City","Low or No Risk","JantoMar12",0.17,0.67,0.17,0,0,1,0,0,0,0,0,0]
["JantoMar12Aberdeen CityNot available","Aberdeen City","Not available","JantoMar12",0,0,0,0,0,0,0.5,0.25,0,0,0.25,1]
["JantoMar12Aberdeen CityTotals","Aberdeen City","Totals","JantoMar12",0.2,0.35,0.15,0.15,0.15,1,0.27,0.61,0.11,0,0.01,1]
["JantoMar12AberdeenshireCritical","Aberdeenshire","Critical","JantoMar12",0.67,0.33,0,0,0,1,0,0,0,0,0,0]
["JantoMar12AberdeenshireSubstantial","Aberdeenshire","Substantial","JantoMar12",0.56000000000000005,0.44,0,0,0,1,0,0,0,0,0,0]
["JantoMar12AberdeenshireModerate","Aberdeenshire","Moderate","JantoMar12",0.82,0.18,0,0,0,1,0,0,0,0,0,0]
["JantoMar12AberdeenshireLow or No Risk","Aberdeenshire","Low or No Risk","JantoMar12",0.82,0.18,0,0,0,1,0,0,0,0,0,0]
["JantoMar12AberdeenshireNot available","Aberdeenshire","Not available","JantoMar12",0.79,0.19,0.02,0,0,1,0,0,0,0,0,0]
["JantoMar12AberdeenshireTotals","Aberdeenshire","Totals","JantoMar12",0.79,0.2,0.02,0,0,1,0,0,0,0,0,0]
["JantoMar12AngusCritical","Angus","Critical","JantoMar12",0,0.28000000000000003,0.21,0.08,0.44,1,0.55000000000000004,0.27,0.14000000000000001,0.02,0.02,1]
["JantoMar12AngusSubstantial","Angus","Substantial","JantoMar12",0.3,0.21,0.21,0.09,0.19,1,0.24,0.69,0.02,0.04,0.01,1]
["JantoMar12AngusModerate","Angus","Moderate","JantoMar12",0.26,0.15,0.19,0,0.41,1,0.41,0.45,0.05,0.05,0.05,1]
["JantoMar12AngusLow or No Risk","Angus","Low or No Risk","JantoMar12",0.27,0.27,0.23,0.05,0.19,1,0.04,0.95,0.01,0,0,1]
["JantoMar12AngusNot available","Angus","Not available","JantoMar12",0,0,0,0,0,0,0,1,0,0,0,1]
["JantoMar12AngusTotals","Angus","Totals","JantoMar12",0.22,0.23,0.21,0.06,0.27,1,0.24,0.68,0.04,0.03,0.01,1]
["JantoMar12Argyll & ButeCritical","Argyll & Bute","Critical","JantoMar12",0,0,0,0,0,0,0,0,0,0,0,0]
["JantoMar12Argyll & ButeSubstantial","Argyll & Bute","Substantial","JantoMar12",0,0,0,0,0,0,0,0,0,0,0,0]
["JantoMar12Argyll & ButeModerate","Argyll & Bute","Moderate","JantoMar12",0,0,0,0,0,0,0,0,0,0,0,0]
["JantoMar12Argyll & ButeLow or No Risk","Argyll & Bute","Low or No Risk","JantoMar12",0,0,0,0,0,0,0,0,0,0,0,0]
["JantoMar12Argyll & ButeNot available","Argyll & Bute","Not available","JantoMar12",0.2,0.4,0.2,0.12,7.0000000000000007E-2,1,0.5,0.25,0.15,7.0000000000000007E-2,0.04,1]
["JantoMar12Argyll & ButeTotals","Argyll & Bute","Totals","JantoMar12",0.2,0.4,0.2,0.12,7.0000000000000007E-2,1,0.5,0.25,0.15,7.0000000000000007E-2,0.04,1]
["JantoMar12ClackmannanshireCritical","Clackmannanshire","Critical","JantoMar12",0,0,0,0,0,0,0,0,0,0,0,0]
["JantoMar12ClackmannanshireSubstantial","Clackmannanshire","Substantial","JantoMar12",0.28999999999999998,0.43,0.14000000000000001,0,0.14000000000000001,1,0,0,0,0,0,0]
["JantoMar12ClackmannanshireModerate","Clackmannanshire","Moderate","JantoMar12",0,0.26,0.13,0.23,0.39,1,0,0,0,0,0,0]
["JantoMar12ClackmannanshireLow or No Risk","Clackmannanshire","Low or No Risk","JantoMar12",0.02,0.14000000000000001,7.0000000000000007E-2,0.16,0.61,1,0,0,0,0,0,0]
["JantoMar12ClackmannanshireNot available","Clackmannanshire","Not available","JantoMar12",0,0,0,0,0,0,0.7,0.26,0.02,0.02,0,1]
["JantoMar12ClackmannanshireTotals","Clackmannanshire","Totals","JantoMar12",0.06,0.22,0.1,0.16,0.46,1,0.7,0.26,0.02,0.02,0,1]
["JantoMar12Dumfries and GallowayCritical","Dumfries and Galloway","Critical","JantoMar12",0,0,0,0,0,0,0,0,0,0,0,0]
["JantoMar12Dumfries and GallowaySubstantial","Dumfries and Galloway","Substantial","JantoMar12",0,0,0,0,0,0,0,0,0,0,0,0]
["JantoMar12Dumfries and GallowayModerate","Dumfries and Galloway","Moderate","JantoMar12",0,0,0,0,0,0,0,0,0,0,0,0]
["JantoMar12Dumfries and GallowayLow or No Risk","Dumfries and Galloway","Low or No Risk","JantoMar12",0,0,0,0,0,0,0,0,0,0,0,0]
["JantoMar12Dumfries and GallowayNot available","Dumfries and Galloway","Not available","JantoMar12",0.09,0.32,0.24,0.11,0.25,1,0.05,0.7,0.14000000000000001,0.05,0.06,1]
["JantoMar12Dumfries and GallowayTotals","Dumfries and Galloway","Totals","JantoMar12",0.09,0.32,0.24,0.11,0.25,1,0.05,0.7,0.14000000000000001,0.05,0.06,1]
["JantoMar12Dundee CityCritical","Dundee City","Critical","JantoMar12",0.22,0.36,0.14000000000000001,0.11,0.17,1,0,0,0,0,0,0]
["JantoMar12Dundee CitySubstantial","Dundee City","Substantial","JantoMar12",0.13,0.42,0.11,0.08,0.26,1,0,0,0,0,0,0]
["JantoMar12Dundee CityModerate","Dundee City","Moderate","JantoMar12",0.1,0.36,0.13,0.09,0.32,1,0,0,0,0,0,0]
["JantoMar12Dundee CityLow or No Risk","Dundee City","Low or No Risk","JantoMar12",0.05,0.26,0.18,0.05,0.46,1,0,0,0,0,0,0]
["JantoMar12Dundee CityNot available","Dundee City","Not available","JantoMar12",0,1,0,0,0,1,0,0,0,0,0,0]
[{"$f":"D836&B836&C836","v":"JantoMar12Dundee CityTotals"},"Dundee City","Totals","JantoMar12",0.11,0.36,0.13,0.08,0.31,1,0,0,0,0,0,0]
["JantoMar12East AyrshireCritical","East Ayrshire","Critical","JantoMar12",0.7,0.16,0.14000000000000001,0,0,1,0.79,0.05,0.09,0.02,0.05,1]
["JantoMar12East AyrshireSubstantial","East Ayrshire","Substantial","JantoMar12",0.36,0.14000000000000001,0.23,0.09,0.18,1,0.65,0.23,0,0.12,0,1]
["JantoMar12East AyrshireModerate","East Ayrshire","Moderate","JantoMar12",0.27,0.28999999999999998,0.28999999999999998,0.08,0.06,1,0.57999999999999996,0.27,0.03,7.0000000000000007E-2,0.05,1]
["JantoMar12East AyrshireLow or No Risk","East Ayrshire","Low or No Risk","JantoMar12",0.67,0.33,0,0,0,1,0.28999999999999998,0.56999999999999995,0.14000000000000001,0,0,1]
["JantoMar12East AyrshireNot available","East Ayrshire","Not available","JantoMar12",0,0,0,0,0,0,0.67,0,0.33,0,0,1]
["JantoMar12East AyrshireTotals","East Ayrshire","Totals","JantoMar12",0.45,0.22,0.21,0.05,0.06,1,0.64,0.2,0.06,0.06,0.04,1]
["JantoMar12East DunbartonshireCritical","East Dunbartonshire","Critical","JantoMar12",0.8,0.2,0,0,0,1,0,1,0,0,0,1]
["JantoMar12East DunbartonshireSubstantial","East Dunbartonshire","Substantial","JantoMar12",0.56000000000000005,0.22,0.14000000000000001,0.05,0.04,1,0,0.97,0.02,0.01,0,1]
["JantoMar12East DunbartonshireModerate","East Dunbartonshire","Moderate","JantoMar12",0.17,0.3,0.17,0.09,0.28000000000000003,1,0,0.97,0.03,0,0,1]
["JantoMar12East DunbartonshireLow or No Risk","East Dunbartonshire","Low or No Risk","JantoMar12",0.33,0.27,0,7.0000000000000007E-2,0.33,1,0,1,0,0,0,1]
["JantoMar12East DunbartonshireNot available","East Dunbartonshire","Not available","JantoMar12",0,0,0,0,0,0,0,0,0,0,0,0]
["JantoMar12East DunbartonshireTotals","East Dunbartonshire","Totals","JantoMar12",0.48,0.24,0.13,0.05,0.1,1,0,0.97,0.02,0.01,0,1]
["JantoMar12East LothianCritical","East Lothian","Critical","JantoMar12",1,0,0,0,0,1,0,0,0,0,0,0]
["JantoMar12East LothianSubstantial","East Lothian","Substantial","JantoMar12",0.25,0.25,0.2,0.09,0.21,1,0.6,0.28999999999999998,7.0000000000000007E-2,0.04,0,1]
["JantoMar12East LothianModerate","East Lothian","Moderate","JantoMar12",0,0,0,0,0,0,0,0,0,0,0,0]
["JantoMar12East LothianLow or No Risk","East Lothian","Low or No Risk","JantoMar12",0,0,0,0,0,0,0,0,0,0,0,0]
["JantoMar12East LothianNot available","East Lothian","Not available","JantoMar12",0,0,0,0,0,0,0,0,0,0,0,0]
["JantoMar12East LothianTotals","East Lothian","Totals","JantoMar12",0.28000000000000003,0.24,0.19,0.08,0.2,1,0.6,0.28999999999999998,7.0000000000000007E-2,0.04,0,1]
["JantoMar12East RenfrewshireCritical","East Renfrewshire","Critical","JantoMar12",0.32,0.47,0.21,0,0,1,0,0.74,0.26,0,0,1]
["JantoMar12East RenfrewshireSubstantial","East Renfrewshire","Substantial","JantoMar12",0.43,0.14000000000000001,0.36,7.0000000000000007E-2,0,1,0,0.93,7.0000000000000007E-2,0,0,1]
["JantoMar12East RenfrewshireModerate","East Renfrewshire","Moderate","JantoMar12",0.26,0.57999999999999996,0.16,0,0,1,0,0.95,0.05,0,0,1]
["JantoMar12East RenfrewshireLow or No Risk","East Renfrewshire","Low or No Risk","JantoMar12",0.25,0.5,0.25,0,0,1,0,1,0,0,0,1]
["JantoMar12East RenfrewshireNot available","East Renfrewshire","Not available","JantoMar12",0.28999999999999998,0.67,0.01,0,0.03,1,0,0.96,0.01,0.03,0,1]
["JantoMar12East RenfrewshireTotals","East Renfrewshire","Totals","JantoMar12",0.3,0.56000000000000005,0.11,0.01,0.02,1,0,0.92,0.06,0.02,0,1]
["JantoMar12Edinburgh, City ofCritical","Edinburgh, City of","Critical","JantoMar12",0,0,0,0,0,0,0,0,0,0,0,0]
["JantoMar12Edinburgh, City ofSubstantial","Edinburgh, City of","Substantial","JantoMar12",0,0,0,0,0,0,0,0,0,0,0,0]
["JantoMar12Edinburgh, City ofModerate","Edinburgh, City of","Moderate","JantoMar12",0,0,0,0,0,0,0,0,0,0,0,0]
["JantoMar12Edinburgh, City ofLow or No Risk","Edinburgh, City of","Low or No Risk","JantoMar12",0,0,0,0,0,0,0,0,0,0,0,0]
["JantoMar12Edinburgh, City ofNot available","Edinburgh, City of","Not available","JantoMar12",0.14000000000000001,0.2,0.19,0.26,0.21,1,0.01,0.71,0.18,7.0000000000000007E-2,0.03,1]
["JantoMar12Edinburgh, City ofTotals","Edinburgh, City of","Totals","JantoMar12",0.14000000000000001,0.2,0.19,0.26,0.21,1,0.01,0.71,0.18,7.0000000000000007E-2,0.03,1]
["JantoMar12Eilean SiarCritical","Eilean Siar","Critical","JantoMar12",0,0,0,0,0,0,0,0,0,0,0,0]
["JantoMar12Eilean SiarSubstantial","Eilean Siar","Substantial","JantoMar12",0,0,0,0,0,0,0,0,0,0,0,0]
["JantoMar12Eilean SiarModerate","Eilean Siar","Moderate","JantoMar12",0,0,0,0,0,0,0,0,0,0,0,0]
["JantoMar12Eilean SiarLow or No Risk","Eilean Siar","Low or No Risk","JantoMar12",0,0,0,0,0,0,0,0,0,0,0,0]
["JantoMar12Eilean SiarNot available","Eilean Siar","Not available","JantoMar12",0,0,0,0,0,0,0,0,0,0,0,0]
["JantoMar12Eilean SiarTotals","Eilean Siar","Totals","JantoMar12",0,0,0,0,0,0,0,0,0,0,0,0]
["JantoMar12FalkirkCritical","Falkirk","Critical","JantoMar12",0.44,0.35,0,0.02,0.2,1,0.82,0.16,0.01,0,0,1]
["JantoMar12FalkirkSubstantial","Falkirk","Substantial","JantoMar12",0.3,0.32,0.11,7.0000000000000007E-2,0.2,1,0.64,0.32,0.01,0.01,0.01,1]
["JantoMar12FalkirkModerate","Falkirk","Moderate","JantoMar12",0.21,0.42,0.26,0,0.11,1,0.27,0.45,0.27,0,0,1]
["JantoMar12FalkirkLow or No Risk","Falkirk","Low or No Risk","JantoMar12",1,0,0,0,0,1,1,0,0,0,0,1]
["JantoMar12FalkirkNot available","Falkirk","Not available","JantoMar12",0,0,0,0,0,0,0.54,0.23,0.15,0.08,0,1]
["JantoMar12FalkirkTotals","Falkirk","Totals","JantoMar12",0.34,0.34,0.09,0.04,0.19,1,0.73,0.22,0.03,0.01,0,1]
["JantoMar12FifeCritical","Fife","Critical","JantoMar12",0.11,0.54,0.16,7.0000000000000007E-2,0.12,1,0.11,0.86,0.04,0,0,1]
["JantoMar12FifeSubstantial","Fife","Substantial","JantoMar12",0.08,0.28000000000000003,0.2,0.11,0.33,1,0.06,0.7,0.19,0.02,0.03,1]
["JantoMar12FifeModerate","Fife","Moderate","JantoMar12",0.02,0.09,0.12,0.17,0.6,1,0,1,0,0,0,1]
["JantoMar12FifeLow or No Risk","Fife","Low or No Risk","JantoMar12",0.03,0.02,0.02,0.03,0.9,1,0,0,0,0,0,0]
["JantoMar12FifeNot available","Fife","Not available","JantoMar12",0.09,0.33,0.25,0.15,0.19,1,0,0.65,0.3,0.05,0,1]
["JantoMar12FifeTotals","Fife","Totals","JantoMar12",7.0000000000000007E-2,0.25,0.17,0.13,0.39,1,0.06,0.73,0.17,0.02,0.02,1]
["JantoMar12Glasgow CityCritical","Glasgow City","Critical","JantoMar12",0.06,0.15,0.16,0.12,0.52,1,0,1,0,0,0,1]
["JantoMar12Glasgow CitySubstantial","Glasgow City","Substantial","JantoMar12",0.06,0.14000000000000001,0.17,0.12,0.51,1,0,1,0,0,0,1]
["JantoMar12Glasgow CityModerate","Glasgow City","Moderate","JantoMar12",0.12,0.13,0.08,0.06,0.61,1,0,1,0,0,0,1]
["JantoMar12Glasgow CityLow or No Risk","Glasgow City","Low or No Risk","JantoMar12",0.06,0.22,0.17,0.11,0.44,1,0,1,0,0,0,1]
["JantoMar12Glasgow CityNot available","Glasgow City","Not available","JantoMar12",7.0000000000000007E-2,0.32,0.19,0.08,0.34,1,0,1,0,0,0,1]
["JantoMar12Glasgow CityTotals","Glasgow City","Totals","JantoMar12",0.08,0.17,0.15,0.1,0.51,1,0,1,0,0,0,1]
["JantoMar12HighlandCritical","Highland","Critical","JantoMar12",0.12,0.31,0.24,0.08,0.24,1,0,0,0,0,0,0]
["JantoMar12HighlandSubstantial","Highland","Substantial","JantoMar12",0.1,0.18,0.15,0.15,0.41,1,0,0,0,0,0,0]
["JantoMar12HighlandModerate","Highland","Moderate","JantoMar12",0.12,0.1,0.12,0.23,0.44,1,0,0,0,0,0,0]
["JantoMar12HighlandLow or No Risk","Highland","Low or No Risk","JantoMar12",0,0,0.33,0,0.67,1,0,0,0,0,0,0]
["JantoMar12HighlandNot available","Highland","Not available","JantoMar12",0.09,0.19,0.19,0.13,0.4,1,0,0,0,0,0,0]
["JantoMar12HighlandTotals","Highland","Totals","JantoMar12",0.11,0.2,0.18,0.14000000000000001,0.36,1,0,0,0,0,0,0]
["JantoMar12InverclydeCritical","Inverclyde","Critical","JantoMar12",7.0000000000000007E-2,0.33,0.27,0.2,0.13,1,0.68,0.26,0.03,0,0.03,1]
["JantoMar12InverclydeSubstantial","Inverclyde","Substantial","JantoMar12",0.09,0.27,0.09,0.27,0.27,1,0.5,0.33,0.06,0.06,0.06,1]
["JantoMar12InverclydeModerate","Inverclyde","Moderate","JantoMar12",7.0000000000000007E-2,0.14000000000000001,0.21,0.21,0.36,1,0.43,0.56999999999999995,0,0,0,1]
[{"$f":"D900&B900&C900","v":"JantoMar12InverclydeLow or No Risk"},"Inverclyde","Low or No Risk","JantoMar12",0.19,0.5,0.06,0,0.25,1,1,0,0,0,0,1]
["JantoMar12InverclydeNot available","Inverclyde","Not available","JantoMar12",0.42,0.42,0.08,0.08,0,1,0.62,0.23,0.08,0,0.08,1]
["JantoMar12InverclydeTotals","Inverclyde","Totals","JantoMar12",0.16,0.34,0.15,0.15,0.21,1,0.6,0.3,0.04,0.01,0.04,1]
["JantoMar12MidlothianCritical","Midlothian","Critical","JantoMar12",0,0,0,0,0,0,0,0,0,0,0,0]
["JantoMar12MidlothianSubstantial","Midlothian","Substantial","JantoMar12",0,0,0,0,0,0,0,0,0,0,0,0]
["JantoMar12MidlothianModerate","Midlothian","Moderate","JantoMar12",0,0,0,0,0,0,0,0,0,0,0,0]
["JantoMar12MidlothianLow or No Risk","Midlothian","Low or No Risk","JantoMar12",0,0,0,0,0,0,0,0,0,0,0,0]
["JantoMar12MidlothianNot available","Midlothian","Not available","JantoMar12",0.01,0.18,0.21,0.13,0.47,1,0,0,0,0,0,0]
["JantoMar12MidlothianTotals","Midlothian","Totals","JantoMar12",0.01,0.18,0.21,0.13,0.47,1,0,0,0,0,0,0]
["JantoMar12MorayCritical","Moray","Critical","JantoMar12",0.34,0.41,0.21,0.03,0,1,0.14000000000000001,0.81,0.05,0,0,1]
["JantoMar12MoraySubstantial","Moray","Substantial","JantoMar12",0.34,0.51,0.14000000000000001,0,0.01,1,0.1,0.82,0.06,0,0.01,1]
["JantoMar12MorayModerate","Moray","Moderate","JantoMar12",0,0,1,0,0,1,0,1,0,0,0,1]
["JantoMar12MorayLow or No Risk","Moray","Low or No Risk","JantoMar12",0.42,0.42,0.17,0,0,1,0,0,0,0,0,0]
["JantoMar12MorayNot available","Moray","Not available","JantoMar12",0,0,0,0,0,0,0,1,0,0,0,1]
["JantoMar12MorayTotals","Moray","Totals","JantoMar12",0.34,0.47,0.17,0.01,0.01,1,0.11,0.83,0.06,0,0.01,1]
["JantoMar12North AyrshireCritical","North Ayrshire","Critical","JantoMar12",0.33,0.22,0,0,0.44,1,1,0,0,0,0,1]
["JantoMar12North AyrshireSubstantial","North Ayrshire","Substantial","JantoMar12",0.14000000000000001,0.27,0.41,0.06,0.13,1,0.78,0.22,0,0,0,1]
["JantoMar12North AyrshireModerate","North Ayrshire","Moderate","JantoMar12",0.33,0.08,0,0.17,0.42,1,1,0,0,0,0,1]
["JantoMar12North AyrshireLow or No Risk","North Ayrshire","Low or No Risk","JantoMar12",0.5,0,0.25,0,0.25,1,1,0,0,0,0,1]
["JantoMar12North AyrshireNot available","North Ayrshire","Not available","JantoMar12",0,0,0,0,0,0,0,0,0,0,0,0]
["JantoMar12North AyrshireTotals","North Ayrshire","Totals","JantoMar12",0.2,0.23,0.31,0.06,0.2,1,0.85,0.15,0,0,0,1]
["JantoMar12North LanarkshireCritical","North Lanarkshire","Critical","JantoMar12",0.64,0.22,0.04,0.03,0.06,1,0.27,0.7,0.01,0.02,0,1]
["JantoMar12North LanarkshireSubstantial","North Lanarkshire","Substantial","JantoMar12",0.44,0.27,0.12,0.03,0.14000000000000001,1,0.39,0.52,0.02,0.02,0.05,1]
["JantoMar12North LanarkshireModerate","North Lanarkshire","Moderate","JantoMar12",0.53,0.25,0.08,0.04,0.1,1,0.33,0.56999999999999995,7.0000000000000007E-2,0,0.03,1]
["JantoMar12North LanarkshireLow or No Risk","North Lanarkshire","Low or No Risk","JantoMar12",0.62,0.17,0.11,0.04,0.06,1,0.24,0.52,0.14000000000000001,0.05,0.05,1]
["JantoMar12North LanarkshireNot available","North Lanarkshire","Not available","JantoMar12",0,0,0,0,0,0,0,0,0,0,0,0]
["JantoMar12North LanarkshireTotals","North Lanarkshire","Totals","JantoMar12",0.56999999999999995,0.23,0.08,0.04,0.09,1,0.31,0.63,0.03,0.02,0.02,1]
["JantoMar12Orkney islandsCritical","Orkney islands","Critical","JantoMar12",0,0,0,0,0,0,0,0,0,0,0,0]
["JantoMar12Orkney islandsSubstantial","Orkney islands","Substantial","JantoMar12",0,0,0,0,0,0,0,0,0,0,0,0]
["JantoMar12Orkney islandsModerate","Orkney islands","Moderate","JantoMar12",0,0,0,0,0,0,0,0,0,0,0,0]
["JantoMar12Orkney islandsLow or No Risk","Orkney islands","Low or No Risk","JantoMar12",0,0,0,0,0,0,0,0,0,0,0,0]
["JantoMar12Orkney islandsNot available","Orkney islands","Not available","JantoMar12",0,0,0,0,0,0,0,0,0,0,0,0]
["JantoMar12Orkney islandsTotals","Orkney islands","Totals","JantoMar12",0,0,0,0,0,0,0,0,0,0,0,0]
["JantoMar12Perth & KinrossCritical","Perth & Kinross","Critical","JantoMar12",0.21,0.71,7.0000000000000007E-2,0,0,1,0,1,0,0,0,1]
["JantoMar12Perth & KinrossSubstantial","Perth & Kinross","Substantial","JantoMar12",0.11,0.34,0.16,0.08,0.3,1,0.2,0.4,0.2,0,0.2,1]
["JantoMar12Perth & KinrossModerate","Perth & Kinross","Moderate","JantoMar12",7.0000000000000007E-2,0.25,0.17,0.09,0.42,1,0,0.67,0.33,0,0,1]
["JantoMar12Perth & KinrossLow or No Risk","Perth & Kinross","Low or No Risk","JantoMar12",0.04,0.15,0.15,0.04,0.62,1,0,0.67,0,0,0.33,1]
["JantoMar12Perth & KinrossNot available","Perth & Kinross","Not available","JantoMar12",0.09,0.12,0.24,0.18,0.38,1,0,0,0,0,1,1]
["JantoMar12Perth & KinrossTotals","Perth & Kinross","Totals","JantoMar12",0.08,0.27,0.17,0.09,0.38,1,0.05,0.42,0.11,0,0.42,1]
["JantoMar12RenfrewshireCritical","Renfrewshire","Critical","JantoMar12",0.82,0.06,0.03,0.06,0.03,1,0.21,0.13,0.24,0.13,0.28999999999999998,1]
["JantoMar12RenfrewshireSubstantial","Renfrewshire","Substantial","JantoMar12",0.61,0.05,0.05,0.05,0.24,1,0.22,0.19,0.25,0.08,0.25,1]
["JantoMar12RenfrewshireModerate","Renfrewshire","Moderate","JantoMar12",0.5,0.17,0,0,0.33,1,0.33,0,0,0,0.67,1]
["JantoMar12RenfrewshireLow or No Risk","Renfrewshire","Low or No Risk","JantoMar12",0.6,0,0.4,0,0,1,0,0,0,0,0,0]
["JantoMar12RenfrewshireNot available","Renfrewshire","Not available","JantoMar12",0.34,0.04,0.04,0.04,0.54,1,0.4,0.2,0.17,7.0000000000000007E-2,0.17,1]
["JantoMar12RenfrewshireTotals","Renfrewshire","Totals","JantoMar12",0.47,0.05,0.05,0.04,0.39,1,0.26,0.16,0.22,0.1,0.26,1]
["JantoMar12Scottish BordersCritical","Scottish Borders","Critical","JantoMar12",0.2,0.3,0.12,0.09,0.28000000000000003,1,7.0000000000000007E-2,0.68,0.14000000000000001,0.1,0.01,1]
["JantoMar12Scottish BordersSubstantial","Scottish Borders","Substantial","JantoMar12",0.03,0.26,0.1,0.06,0.54,1,0.2,0.6,0.1,0,0.1,1]
["JantoMar12Scottish BordersModerate","Scottish Borders","Moderate","JantoMar12",0,0,0,0.14000000000000001,0.86,1,0,0,0,1,0,1]
["JantoMar12Scottish BordersLow or No Risk","Scottish Borders","Low or No Risk","JantoMar12",0,0,0.2,0,0.8,1,0,0,0,0,0,0]
["JantoMar12Scottish BordersNot available","Scottish Borders","Not available","JantoMar12",0,0,0,0,0,0,0,0,0,0,0,0]
["JantoMar12Scottish BordersTotals","Scottish Borders","Totals","JantoMar12",0.15,0.28000000000000003,0.11,0.08,0.37,1,0.09,0.66,0.13,0.1,0.02,1]
["JantoMar12Shetland islandsCritical","Shetland islands","Critical","JantoMar12",0,0,0,1,0,1,0,0.43,0.43,0.14000000000000001,0,1]
["JantoMar12Shetland islandsSubstantial","Shetland islands","Substantial","JantoMar12",0,0,1,0,0,1,0,0.78,0.22,0,0,1]
["JantoMar12Shetland islandsModerate","Shetland islands","Moderate","JantoMar12",0.5,0.5,0,0,0,1,0.5,0.5,0,0,0,1]
["JantoMar12Shetland islandsLow or No Risk","Shetland islands","Low or No Risk","JantoMar12",0,0,0,0,0,0,0,0,0,0,0,0]
["JantoMar12Shetland islandsNot available","Shetland islands","Not available","JantoMar12",0.13,0.47,0.2,0.04,0.16,1,0.08,0.92,0,0,0,1]
["JantoMar12Shetland islandsTotals","Shetland islands","Totals","JantoMar12",0.14000000000000001,0.43,0.2,0.1,0.14000000000000001,1,7.0000000000000007E-2,0.73,0.17,0.03,0,1]
["JantoMar12South AyrshireCritical","South Ayrshire","Critical","JantoMar12",0.16,0.44,0.25,0.16,0,1,0.59,0.27,0.15,0,0,1]
["JantoMar12South AyrshireSubstantial","South Ayrshire","Substantial","JantoMar12",0.3,0.5,0.1,0.1,0,1,0.19,0.63,0.19,0,0,1]
["JantoMar12South AyrshireModerate","South Ayrshire","Moderate","JantoMar12",0.27,0.31,0.27,0.16,0,1,0.46,0.38,0.17,0,0,1]
["JantoMar12South AyrshireLow or No Risk","South Ayrshire","Low or No Risk","JantoMar12",0.28999999999999998,0.31,0.3,0.1,0,1,0.64,0.2,0.16,0,0,1]
["JantoMar12South AyrshireNot available","South Ayrshire","Not available","JantoMar12",0,0,0,0,0,0,0,0,0,0,0,0]
["JantoMar12South AyrshireTotals","South Ayrshire","Totals","JantoMar12",0.24,0.36,0.26,0.13,0,1,0.51,0.33,0.16,0,0,1]
["JantoMar12South LanarkshireCritical","South Lanarkshire","Critical","JantoMar12",0,0,0,0,0,0,0,0,0,0,0,0]
[{"$f":"D964&B964&C964","v":"JantoMar12South LanarkshireSubstantial"},"South Lanarkshire","Substantial","JantoMar12",0,0,0,0,0,0,0,0,0,0,0,0]
["JantoMar12South LanarkshireModerate","South Lanarkshire","Moderate","JantoMar12",0,0,0,0,0,0,0,0,0,0,0,0]
["JantoMar12South LanarkshireLow or No Risk","South Lanarkshire","Low or No Risk","JantoMar12",0,0,0,0,0,0,0,0,0,0,0,0]
["JantoMar12South LanarkshireNot available","South Lanarkshire","Not available","JantoMar12",0,0,0,0,0,0,0,0,0,0,0,0]
["JantoMar12South LanarkshireTotals","South Lanarkshire","Totals","JantoMar12",0,0,0,0,0,0,0,0,0,0,0,0]
["JantoMar12StirlingCritical","Stirling","Critical","JantoMar12",0.76,0.09,0,7.0000000000000007E-2,7.0000000000000007E-2,1,0.13,0.67,0.17,0.02,0.02,1]
["JantoMar12StirlingSubstantial","Stirling","Substantial","JantoMar12",0.51,0.1,0.09,0.05,0.24,1,0.05,0.86,0,0.09,0,1]
["JantoMar12StirlingModerate","Stirling","Moderate","JantoMar12",0.27,0.09,0,0,0.64,1,0.25,0.5,0,0.25,0,1]
["JantoMar12StirlingLow or No Risk","Stirling","Low or No Risk","JantoMar12",0,0,0,0,0,0,0,0,0,0,0,0]
["JantoMar12StirlingNot available","Stirling","Not available","JantoMar12",0.25,0.28999999999999998,0.11,7.0000000000000007E-2,0.28999999999999998,1,0.34,0.38,0.06,0.09,0.13,1]
["JantoMar12StirlingTotals","Stirling","Totals","JantoMar12",0.5,0.15,7.0000000000000007E-2,0.06,0.23,1,0.19,0.6,0.1,0.06,0.05,1]
["JantoMar12West DunbartonshireCritical","West Dunbartonshire","Critical","JantoMar12",0.69,0.19,7.0000000000000007E-2,0.02,0.03,1,0.82,0.11,0.05,0,0.03,1]
["JantoMar12West DunbartonshireSubstantial","West Dunbartonshire","Substantial","JantoMar12",0.57999999999999996,0.12,0.08,0.15,7.0000000000000007E-2,1,0.83,0.12,0.03,0,0.02,1]
["JantoMar12West DunbartonshireModerate","West Dunbartonshire","Moderate","JantoMar12",0.73,0.14000000000000001,0.05,0.04,0.05,1,0.74,0.09,7.0000000000000007E-2,0.06,0.04,1]
["JantoMar12West DunbartonshireLow or No Risk","West Dunbartonshire","Low or No Risk","JantoMar12",0.83,0.05,0.04,0.03,0.06,1,0.67,0.14000000000000001,0.05,0,0.14000000000000001,1]
["JantoMar12West DunbartonshireNot available","West Dunbartonshire","Not available","JantoMar12",0,0,0,0,0,0,0,0,0,0,0,0]
["JantoMar12West DunbartonshireTotals","West Dunbartonshire","Totals","JantoMar12",0.72,0.11,0.06,0.06,0.05,1,0.78,0.11,0.05,0.02,0.04,1]
["JantoMar12West LothianCritical","West Lothian","Critical","JantoMar12",0.06,0.31,0.28999999999999998,0.21,0.13,1,0.18,0.7,7.0000000000000007E-2,0.04,0.01,1]
["JantoMar12West LothianSubstantial","West Lothian","Substantial","JantoMar12",0.06,0.28999999999999998,0.32,0.22,0.11,1,0.28999999999999998,0.38,0.09,0.09,0.15,1]
["JantoMar12West LothianModerate","West Lothian","Moderate","JantoMar12",0,0.17,0.25,0.38,0.21,1,7.0000000000000007E-2,0.36,0.5,7.0000000000000007E-2,0,1]
["JantoMar12West LothianLow or No Risk","West Lothian","Low or No Risk","JantoMar12",0,0.08,0.25,0.17,0.5,1,0.25,0.13,0.38,0.13,0.13,1]
["JantoMar12West LothianNot available","West Lothian","Not available","JantoMar12",0.43,0,0,0.56999999999999995,0,1,0,1,0,0,0,1]
["JantoMar12West LothianTotals","West Lothian","Totals","JantoMar12",0.06,0.25,0.28000000000000003,0.25,0.16,1,0.21,0.54,0.13,0.06,0.06,1]
["JantoMar12SCOTLAND TOTALSCritical","SCOTLAND TOTALS","Critical","JantoMar12",0.34,0.28000000000000003,0.12,0.08,0.17,1,0.39,0.48,0.08,0.03,0.03,1]
["JantoMar12SCOTLAND TOTALSSubstantial","SCOTLAND TOTALS","Substantial","JantoMar12",0.21,0.23,0.17,0.09,0.28999999999999998,1,0.23,0.66,0.06,0.02,0.02,1]
["JantoMar12SCOTLAND TOTALSModerate","SCOTLAND TOTALS","Moderate","JantoMar12",0.21,0.2,0.12,0.1,0.38,1,0.28999999999999998,0.6,0.06,0.02,0.02,1]
["JantoMar12SCOTLAND TOTALSLow or No Risk","SCOTLAND TOTALS","Low or No Risk","JantoMar12",0.39,0.18,0.13,0.05,0.25,1,0.24,0.65,7.0000000000000007E-2,0.01,0.03,1]
["JantoMar12SCOTLAND TOTALSNot available","SCOTLAND TOTALS","Not available","JantoMar12",0.18,0.24,0.17,0.16,0.24,1,0.15,0.63,0.13,0.06,0.04,1]
["JantoMar12SCOTLAND TOTALSTotals","SCOTLAND TOTALS","Totals","JantoMar12",0.24,0.23,0.15,0.11,0.27,1,0.25,0.6,0.09,0.03,0.03,1]
["AprtoJun12Aberdeen CityCritical","Aberdeen City","Critical","AprtoJun12",0.53,0.38,0.06,0,0.03,1,0.24,0.71,0,0.06,0,1]
["AprtoJun12Aberdeen CitySubstantial","Aberdeen City","Substantial","AprtoJun12",0.28999999999999998,0.24,0.18,0.16,0.12,1,0.41,0.41,0.12,0.06,0,1]
["AprtoJun12Aberdeen CityModerate","Aberdeen City","Moderate","AprtoJun12",0.21,0.28000000000000003,0.24,7.0000000000000007E-2,0.21,1,0,1,0,0,0,1]
["AprtoJun12Aberdeen CityLow or No Risk","Aberdeen City","Low or No Risk","AprtoJun12",0.33,0,0.17,0,0.5,1,0,1,0,0,0,1]
["AprtoJun12Aberdeen CityNot available","Aberdeen City","Not available","AprtoJun12",0,0,0,0,0,0,0,0,0,0,0,0]
["AprtoJun12Aberdeen CityTotals","Aberdeen City","Totals","AprtoJun12",0.34,0.28000000000000003,0.16,0.09,0.14000000000000001,1,0.28000000000000003,0.62,0.05,0.05,0,1]
["AprtoJun12AberdeenshireCritical","Aberdeenshire","Critical","AprtoJun12",0,0.25,0.25,0,0.5,1,0,0,0,0,0,0]
["AprtoJun12AberdeenshireSubstantial","Aberdeenshire","Substantial","AprtoJun12",0,0.44,0.11,0.22,0.22,1,0,0,0,0,0,0]
["AprtoJun12AberdeenshireModerate","Aberdeenshire","Moderate","AprtoJun12",0,0.31,0.31,0.23,0.15,1,0,0,0,0,0,0]
["AprtoJun12AberdeenshireLow or No Risk","Aberdeenshire","Low or No Risk","AprtoJun12",0,0.82,0,0,0.18,1,0,0,0,0,0,0]
["AprtoJun12AberdeenshireNot available","Aberdeenshire","Not available","AprtoJun12",0.06,0.32,0.18,0.11,0.34,1,0,0,0,0,0,0]
["AprtoJun12AberdeenshireTotals","Aberdeenshire","Totals","AprtoJun12",0.05,0.35,0.18,0.11,0.32,1,0,0,0,0,0,0]
["AprtoJun12AngusCritical","Angus","Critical","AprtoJun12",0,0.15,0.31,0.15,0.38,1,0.57999999999999996,0.24,0.08,0.08,0.03,1]
["AprtoJun12AngusSubstantial","Angus","Substantial","AprtoJun12",0.22,0.19,0.13,0.16,0.31,1,0.34,0.51,0.11,0.02,0.03,1]
["AprtoJun12AngusModerate","Angus","Moderate","AprtoJun12",0.38,0.06,0.12,0.12,0.32,1,0.35,0.65,0,0,0,1]
["AprtoJun12AngusLow or No Risk","Angus","Low or No Risk","AprtoJun12",0.46,0.15,0.24,0.04,0.1,1,0.01,0.99,0,0,0,1]
["AprtoJun12AngusNot available","Angus","Not available","AprtoJun12",0,0.14000000000000001,0,0,0.86,1,1,0,0,0,0,1]
["AprtoJun12AngusTotals","Angus","Totals","AprtoJun12",0.31,0.14000000000000001,0.19,0.1,0.27,1,0.26,0.66,0.05,0.02,0.01,1]
["AprtoJun12Argyll & ButeCritical","Argyll & Bute","Critical","AprtoJun12",0.47,0.41,0.12,0,0,1,0.28000000000000003,0.39,0,0.22,0.11,1]
["AprtoJun12Argyll & ButeSubstantial","Argyll & Bute","Substantial","AprtoJun12",0.51,0.23,0.14000000000000001,0.09,0.03,1,0.16,0.28999999999999998,0.06,0.23,0.26,1]
["AprtoJun12Argyll & ButeModerate","Argyll & Bute","Moderate","AprtoJun12",0.47,0.16,0.11,0.16,0.11,1,0.14000000000000001,0,0.14000000000000001,0,0.71,1]
["AprtoJun12Argyll & ButeLow or No Risk","Argyll & Bute","Low or No Risk","AprtoJun12",0,1,0,0,0,1,0,0,0,0,0,0]
["AprtoJun12Argyll & ButeNot available","Argyll & Bute","Not available","AprtoJun12",0,0,0,0,0,0,0.4,0.23,0.17,0.08,0.12,1]
["AprtoJun12Argyll & ButeTotals","Argyll & Bute","Totals","AprtoJun12",0.48,0.3,0.12,7.0000000000000007E-2,0.03,1,0.3,0.26,0.11,0.14000000000000001,0.19,1]
["AprtoJun12ClackmannanshireCritical","Clackmannanshire","Critical","AprtoJun12",0,0,0,0,0,0,0,0,0,0,0,0]
["AprtoJun12ClackmannanshireSubstantial","Clackmannanshire","Substantial","AprtoJun12",0.12,0.44,0.04,0.12,0.28000000000000003,1,0,0,0,0,0,0]
["AprtoJun12ClackmannanshireModerate","Clackmannanshire","Moderate","AprtoJun12",0.02,0.16,0.21,0.26,0.35,1,0,0,0,0,0,0]
["AprtoJun12ClackmannanshireLow or No Risk","Clackmannanshire","Low or No Risk","AprtoJun12",0,0.06,0.11,0.08,0.75,1,0,0,0,0,0,0]
["AprtoJun12ClackmannanshireNot available","Clackmannanshire","Not available","AprtoJun12",0,0,0,0,0,0,0.63,0.34,0.02,0.01,0,1]
["AprtoJun12ClackmannanshireTotals","Clackmannanshire","Totals","AprtoJun12",0.04,0.19,0.13,0.16,0.47,1,0.63,0.34,0.02,0.01,0,1]
["AprtoJun12Dumfries and GallowayCritical","Dumfries and Galloway","Critical","AprtoJun12",0,0,0,0,0,0,0,0,0,0,0,0]
["AprtoJun12Dumfries and GallowaySubstantial","Dumfries and Galloway","Substantial","AprtoJun12",0,0,0,0,0,0,0,0,0,0,0,0]
["AprtoJun12Dumfries and GallowayModerate","Dumfries and Galloway","Moderate","AprtoJun12",0,0,0,0,0,0,0,0,0,0,0,0]
["AprtoJun12Dumfries and GallowayLow or No Risk","Dumfries and Galloway","Low or No Risk","AprtoJun12",0,0,0,0,0,0,0,0,0,0,0,0]
["AprtoJun12Dumfries and GallowayNot available","Dumfries and Galloway","Not available","AprtoJun12",0.11,0.36,0.24,0.12,0.16,1,0.04,0.7,0.21,0.03,0.02,1]
[{"$f":"D1028&B1028&C1028","v":"AprtoJun12Dumfries and GallowayTotals"},"Dumfries and Galloway","Totals","AprtoJun12",0.11,0.36,0.24,0.12,0.16,1,0.04,0.7,0.21,0.03,0.02,1]
["AprtoJun12Dundee CityCritical","Dundee City","Critical","AprtoJun12",0.2,0.56000000000000005,0.08,0.08,0.08,1,0.02,0.73,0.08,7.0000000000000007E-2,0.11,1]
["AprtoJun12Dundee CitySubstantial","Dundee City","Substantial","AprtoJun12",0.05,0.33,0.13,0.18,0.31,1,0,0.73,7.0000000000000007E-2,0.04,0.16,1]
["AprtoJun12Dundee CityModerate","Dundee City","Moderate","AprtoJun12",0.09,0.25,0.18,0.14000000000000001,0.34,1,0,0.65,0.11,0.06,0.17,1]
["AprtoJun12Dundee CityLow or No Risk","Dundee City","Low or No Risk","AprtoJun12",0.04,0.23,0.21,0.17,0.35,1,0.03,0.68,0.11,0.08,0.11,1]
["AprtoJun12Dundee CityNot available","Dundee City","Not available","AprtoJun12",0.33,0.33,0,0.33,0,1,0,0,0,0,1,1]
["AprtoJun12Dundee CityTotals","Dundee City","Totals","AprtoJun12",0.08,0.28000000000000003,0.17,0.15,0.32,1,0.01,0.69,0.09,0.06,0.16,1]
["AprtoJun12East AyrshireCritical","East Ayrshire","Critical","AprtoJun12",0.7,0.16,0.14000000000000001,0,0,1,0.79,0.05,0.09,0.02,0.05,1]
["AprtoJun12East AyrshireSubstantial","East Ayrshire","Substantial","AprtoJun12",0.36,0.14000000000000001,0.23,0.09,0.18,1,0.65,0.23,0,0.12,0,1]
["AprtoJun12East AyrshireModerate","East Ayrshire","Moderate","AprtoJun12",0.27,0.28999999999999998,0.28999999999999998,0.08,0.06,1,0.57999999999999996,0.27,0.03,7.0000000000000007E-2,0.05,1]
["AprtoJun12East AyrshireLow or No Risk","East Ayrshire","Low or No Risk","AprtoJun12",0.67,0.33,0,0,0,1,0.28999999999999998,0.56999999999999995,0.14000000000000001,0,0,1]
["AprtoJun12East AyrshireNot available","East Ayrshire","Not available","AprtoJun12",0,0,0,0,0,0,0.67,0,0.33,0,0,1]
["AprtoJun12East AyrshireTotals","East Ayrshire","Totals","AprtoJun12",0.45,0.22,0.21,0.05,0.06,1,0.64,0.2,0.06,0.06,0.04,1]
["AprtoJun12East DunbartonshireCritical","East Dunbartonshire","Critical","AprtoJun12",0,0,0,0,0,0,0,1,0,0,0,1]
["AprtoJun12East DunbartonshireSubstantial","East Dunbartonshire","Substantial","AprtoJun12",0.75,0.16,0.06,0.03,0,1,0,0.94,0.03,0.01,0.01,1]
["AprtoJun12East DunbartonshireModerate","East Dunbartonshire","Moderate","AprtoJun12",0.37,0.3,0.15,0.19,0,1,0,0.93,7.0000000000000007E-2,0,0,1]
["AprtoJun12East DunbartonshireLow or No Risk","East Dunbartonshire","Low or No Risk","AprtoJun12",0.4,0.4,0.1,0.1,0,1,0,1,0,0,0,1]
["AprtoJun12East DunbartonshireNot available","East Dunbartonshire","Not available","AprtoJun12",0,0,0,0,0,0,0,0,0,0,0,0]
["AprtoJun12East DunbartonshireTotals","East Dunbartonshire","Totals","AprtoJun12",0.69,0.19,7.0000000000000007E-2,0.05,0,1,0,0.95,0.03,0.01,0.01,1]
["AprtoJun12East LothianCritical","East Lothian","Critical","AprtoJun12",0,0,0,0,0,0,0.17,0.83,0,0,0,1]
["AprtoJun12East LothianSubstantial","East Lothian","Substantial","AprtoJun12",0.24,0.26,0.21,0.1,0.2,1,0.28000000000000003,0.56999999999999995,0.09,0.04,0.02,1]
["AprtoJun12East LothianModerate","East Lothian","Moderate","AprtoJun12",0,0,0,0,0,0,0,0,0,0,0,0]
["AprtoJun12East LothianLow or No Risk","East Lothian","Low or No Risk","AprtoJun12",0,0,0,0,0,0,0,0,0,0,0,0]
["AprtoJun12East LothianNot available","East Lothian","Not available","AprtoJun12",0,0,0,0,0,0,0,0,0,0,0,0]
["AprtoJun12East LothianTotals","East Lothian","Totals","AprtoJun12",0.24,0.26,0.21,0.1,0.2,1,0.28000000000000003,0.57999999999999996,0.09,0.04,0.02,1]
["AprtoJun12East RenfrewshireCritical","East Renfrewshire","Critical","AprtoJun12",0.33,0.48,0.19,0,0,1,0,0.74,0.26,0,0,1]
["AprtoJun12East RenfrewshireSubstantial","East Renfrewshire","Substantial","AprtoJun12",0.45,0.1,0.4,0.05,0,1,0,0.93,7.0000000000000007E-2,0,0,1]
["AprtoJun12East RenfrewshireModerate","East Renfrewshire","Moderate","AprtoJun12",0.26,0.59,0.15,0,0,1,0,0.95,0.05,0,0,1]
["AprtoJun12East RenfrewshireLow or No Risk","East Renfrewshire","Low or No Risk","AprtoJun12",0.22,0.56000000000000005,0.11,0.11,0,1,0,1,0,0,0,1]
["AprtoJun12East RenfrewshireNot available","East Renfrewshire","Not available","AprtoJun12",0.28999999999999998,0.67,0.01,0.03,0,1,0,0.93,0.06,0.01,0,1]
["AprtoJun12East RenfrewshireTotals","East Renfrewshire","Totals","AprtoJun12",0.3,0.56000000000000005,0.1,0.03,0,1,0,0.91,0.08,0.01,0,1]
["AprtoJun12Edinburgh, City ofCritical","Edinburgh, City of","Critical","AprtoJun12",0,0,0,0,0,0,0,0,0,0,0,0]
["AprtoJun12Edinburgh, City ofSubstantial","Edinburgh, City of","Substantial","AprtoJun12",0,0,0,0,0,0,0,0,0,0,0,0]
["AprtoJun12Edinburgh, City ofModerate","Edinburgh, City of","Moderate","AprtoJun12",0,0,0,0,0,0,0,0,0,0,0,0]
["AprtoJun12Edinburgh, City ofLow or No Risk","Edinburgh, City of","Low or No Risk","AprtoJun12",0,0,0,0,0,0,0,0,0,0,0,0]
["AprtoJun12Edinburgh, City ofNot available","Edinburgh, City of","Not available","AprtoJun12",0.13,0.18,0.17,0.19,0.33,1,0.03,0.73,0.15,7.0000000000000007E-2,0.02,1]
["AprtoJun12Edinburgh, City ofTotals","Edinburgh, City of","Totals","AprtoJun12",0.13,0.18,0.17,0.19,0.33,1,0.03,0.73,0.15,7.0000000000000007E-2,0.02,1]
["AprtoJun12Eilean SiarCritical","Eilean Siar","Critical","AprtoJun12",0,0.33,0,0,0.67,1,0,0.67,0,0,0.33,1]
["AprtoJun12Eilean SiarSubstantial","Eilean Siar","Substantial","AprtoJun12",0.21,0.64,0.14000000000000001,0,0,1,0.04,0.75,0.14000000000000001,0.04,0.04,1]
["AprtoJun12Eilean SiarModerate","Eilean Siar","Moderate","AprtoJun12",0,0,0,0,0,0,0,0,0,0,0,0]
["AprtoJun12Eilean SiarLow or No Risk","Eilean Siar","Low or No Risk","AprtoJun12",0,0,0,0,0,0,0,0,0,0,0,0]
["AprtoJun12Eilean SiarNot available","Eilean Siar","Not available","AprtoJun12",0.23,0.46,0.31,0,0,1,0.15,0.77,0,0,0.08,1]
["AprtoJun12Eilean SiarTotals","Eilean Siar","Totals","AprtoJun12",0.2,0.56999999999999995,0.18,0,0.05,1,7.0000000000000007E-2,0.75,0.09,0.02,7.0000000000000007E-2,1]
["AprtoJun12FalkirkCritical","Falkirk","Critical","AprtoJun12",0.4,0.22,0.03,0.09,0.25,1,0.96,0.04,0,0,0,1]
["AprtoJun12FalkirkSubstantial","Falkirk","Substantial","AprtoJun12",0.28999999999999998,0.24,0.11,0.05,0.3,1,0.78,0.22,0,0,0,1]
["AprtoJun12FalkirkModerate","Falkirk","Moderate","AprtoJun12",0.15,0.21,0.13,0.04,0.46,1,0.67,0.33,0,0,0,1]
["AprtoJun12FalkirkLow or No Risk","Falkirk","Low or No Risk","AprtoJun12",0,0.33,0.11,0.11,0.44,1,1,0,0,0,0,1]
["AprtoJun12FalkirkNot available","Falkirk","Not available","AprtoJun12",0,0,0,0,0,0,0,0,0,0,0,0]
["AprtoJun12FalkirkTotals","Falkirk","Totals","AprtoJun12",0.28000000000000003,0.23,0.09,0.06,0.33,1,0.9,0.1,0,0,0,1]
["AprtoJun12FifeCritical","Fife","Critical","AprtoJun12",0.08,0.68,0.15,0.04,0.06,1,0,0.83,0.13,0,0.04,1]
["AprtoJun12FifeSubstantial","Fife","Substantial","AprtoJun12",7.0000000000000007E-2,0.28000000000000003,0.15,0.14000000000000001,0.37,1,7.0000000000000007E-2,0.72,0.11,0.03,0.08,1]
["AprtoJun12FifeModerate","Fife","Moderate","AprtoJun12",0.02,0.12,0.08,0.19,0.59,1,0,0.67,0.17,0.17,0,1]
["AprtoJun12FifeLow or No Risk","Fife","Low or No Risk","AprtoJun12",0.02,0.04,0.02,0.09,0.84,1,0,0,0,0,0,0]
["AprtoJun12FifeNot available","Fife","Not available","AprtoJun12",7.0000000000000007E-2,0.35,0.23,0.1,0.25,1,0.14000000000000001,0.56999999999999995,0.14000000000000001,0.14000000000000001,0,1]
["AprtoJun12FifeTotals","Fife","Totals","AprtoJun12",0.05,0.27,0.13,0.13,0.41,1,0.06,0.72,0.11,0.04,7.0000000000000007E-2,1]
["AprtoJun12Glasgow CityCritical","Glasgow City","Critical","AprtoJun12",0.03,0.12,0.17,0.12,0.55000000000000004,1,0,1,0,0,0,1]
["AprtoJun12Glasgow CitySubstantial","Glasgow City","Substantial","AprtoJun12",7.0000000000000007E-2,0.12,0.17,0.1,0.53,1,0,1,0,0,0,1]
["AprtoJun12Glasgow CityModerate","Glasgow City","Moderate","AprtoJun12",0.12,0.17,0.13,0.06,0.52,1,0,1,0,0,0,1]
["AprtoJun12Glasgow CityLow or No Risk","Glasgow City","Low or No Risk","AprtoJun12",0.15,0.19,0.08,0.08,0.5,1,0,1,0,0,0,1]
["AprtoJun12Glasgow CityNot available","Glasgow City","Not available","AprtoJun12",0.15,0.43,0.14000000000000001,0.08,0.2,1,0,1,0,0,0,1]
["AprtoJun12Glasgow CityTotals","Glasgow City","Totals","AprtoJun12",0.1,0.21,0.15,0.09,0.45,1,0,1,0,0,0,1]
["AprtoJun12HighlandCritical","Highland","Critical","AprtoJun12",0.13,0.27,0.28999999999999998,0.08,0.23,1,0,0,0,0,0,0]
["AprtoJun12HighlandSubstantial","Highland","Substantial","AprtoJun12",0.08,0.1,0.15,0.12,0.54,1,0,0,0,0,0,0]
["AprtoJun12HighlandModerate","Highland","Moderate","AprtoJun12",0.02,0.2,0.18,0.2,0.41,1,0,0,0,0,0,0]
[{"$f":"D1092&B1092&C1092","v":"AprtoJun12HighlandLow or No Risk"},"Highland","Low or No Risk","AprtoJun12",0.11,0,0.11,0.33,0.44,1,0,0,0,0,0,0]
["AprtoJun12HighlandNot available","Highland","Not available","AprtoJun12",0.05,0.23,0.32,7.0000000000000007E-2,0.32,1,0,0,0,0,0,0]
["AprtoJun12HighlandTotals","Highland","Totals","AprtoJun12",0.08,0.2,0.24,0.12,0.37,1,0,0,0,0,0,0]
["AprtoJun12InverclydeCritical","Inverclyde","Critical","AprtoJun12",0.06,0.18,0.18,0.18,0.41,1,0.27,0.41,0.15,0.02,0.15,1]
["AprtoJun12InverclydeSubstantial","Inverclyde","Substantial","AprtoJun12",0.17,0.39,0.11,0.28000000000000003,0.06,1,0.38,0.48,0.1,0,0.05,1]
["AprtoJun12InverclydeModerate","Inverclyde","Moderate","AprtoJun12",0.15,0.38,0.15,0.23,0.08,1,0.31,0.56000000000000005,0,0.13,0,1]
["AprtoJun12InverclydeLow or No Risk","Inverclyde","Low or No Risk","AprtoJun12",0,0.11,0.33,0.33,0.22,1,0.5,0,0,0,0.5,1]
["AprtoJun12InverclydeNot available","Inverclyde","Not available","AprtoJun12",0,0,0,0,0,0,0,0.33,0.67,0,0,1]
["AprtoJun12InverclydeTotals","Inverclyde","Totals","AprtoJun12",0.11,0.28000000000000003,0.18,0.25,0.19,1,0.32,0.45,0.12,0.03,0.09,1]
["AprtoJun12MidlothianCritical","Midlothian","Critical","AprtoJun12",0,0,0,0,0,0,0,0,0,0,0,0]
["AprtoJun12MidlothianSubstantial","Midlothian","Substantial","AprtoJun12",0,0,0,0,0,0,0,0,0,0,0,0]
["AprtoJun12MidlothianModerate","Midlothian","Moderate","AprtoJun12",0,0,0,0,0,0,0,0,0,0,0,0]
["AprtoJun12MidlothianLow or No Risk","Midlothian","Low or No Risk","AprtoJun12",0,0,0,0,0,0,0,0,0,0,0,0]
["AprtoJun12MidlothianNot available","Midlothian","Not available","AprtoJun12",0.01,7.0000000000000007E-2,0.28000000000000003,0.11,0.52,1,0,0,0,0,0,0]
["AprtoJun12MidlothianTotals","Midlothian","Totals","AprtoJun12",0.01,7.0000000000000007E-2,0.28000000000000003,0.11,0.52,1,0,0,0,0,0,0]
["AprtoJun12MorayCritical","Moray","Critical","AprtoJun12",0.28999999999999998,0.28999999999999998,0.43,0,0,1,0.08,0.69,0.23,0,0,1]
["AprtoJun12MoraySubstantial","Moray","Substantial","AprtoJun12",0.41,0.39,0.2,0,0,1,0.64,0.28000000000000003,0.08,0,0,1]
["AprtoJun12MorayModerate","Moray","Moderate","AprtoJun12",0.36,0.36,0.27,0,0,1,0,1,0,0,0,1]
["AprtoJun12MorayLow or No Risk","Moray","Low or No Risk","AprtoJun12",0,0,0,0,0,0,0,0,0,0,0,0]
["AprtoJun12MorayNot available","Moray","Not available","AprtoJun12",0.5,0,0.5,0,0,1,0,0,0,0,0,0]
["AprtoJun12MorayTotals","Moray","Totals","AprtoJun12",0.39,0.36,0.25,0,0,1,0.55000000000000004,0.35,0.1,0,0,1]
["AprtoJun12North AyrshireCritical","North Ayrshire","Critical","AprtoJun12",0,0.5,0,0,0.5,1,0,1,0,0,0,1]
["AprtoJun12North AyrshireSubstantial","North Ayrshire","Substantial","AprtoJun12",0.09,0.42,0.19,7.0000000000000007E-2,0.23,1,1,0,0,0,0,1]
["AprtoJun12North AyrshireModerate","North Ayrshire","Moderate","AprtoJun12",0,0.2,0,0,0.8,1,1,0,0,0,0,1]
["AprtoJun12North AyrshireLow or No Risk","North Ayrshire","Low or No Risk","AprtoJun12",0,0,0,0.33,0.67,1,0,0,0,0,0,0]
["AprtoJun12North AyrshireNot available","North Ayrshire","Not available","AprtoJun12",0,0,0,0,1,1,0,0,0,0,0,0]
["AprtoJun12North AyrshireTotals","North Ayrshire","Totals","AprtoJun12",7.0000000000000007E-2,0.37,0.15,7.0000000000000007E-2,0.33,1,0.96,0.04,0,0,0,1]
["AprtoJun12North LanarkshireCritical","North Lanarkshire","Critical","AprtoJun12",0.68,0.2,0.06,0.03,0.04,1,0.28000000000000003,0.66,0.04,0.01,0.02,1]
["AprtoJun12North LanarkshireSubstantial","North Lanarkshire","Substantial","AprtoJun12",0.48,0.26,0.11,0.02,0.12,1,0.43,0.45,0.06,0.01,0.04,1]
["AprtoJun12North LanarkshireModerate","North Lanarkshire","Moderate","AprtoJun12",0.47,0.24,0.09,0.04,0.16,1,0.35,0.56999999999999995,0.06,0,0.02,1]
["AprtoJun12North LanarkshireLow or No Risk","North Lanarkshire","Low or No Risk","AprtoJun12",0.57999999999999996,0.24,0.08,0.06,0.04,1,0.37,0.37,0.04,0.11,0.11,1]
["AprtoJun12North LanarkshireNot available","North Lanarkshire","Not available","AprtoJun12",0,0,0,0,0,0,0,0,0,0,0,0]
["AprtoJun12North LanarkshireTotals","North Lanarkshire","Totals","AprtoJun12",0.56999999999999995,0.23,0.08,0.04,0.08,1,0.33,0.56999999999999995,0.05,0.01,0.03,1]
["AprtoJun12Orkney islandsCritical","Orkney islands","Critical","AprtoJun12",0,0,0,0,0,0,0,0,0,0,0,0]
["AprtoJun12Orkney islandsSubstantial","Orkney islands","Substantial","AprtoJun12",0,0,0,0,0,0,0,0,0,0,0,0]
["AprtoJun12Orkney islandsModerate","Orkney islands","Moderate","AprtoJun12",0,0,0,0,0,0,0,0,0,0,0,0]
["AprtoJun12Orkney islandsLow or No Risk","Orkney islands","Low or No Risk","AprtoJun12",0,0,0,0,0,0,0,0,0,0,0,0]
["AprtoJun12Orkney islandsNot available","Orkney islands","Not available","AprtoJun12",0,0,0,0,0,0,0,0,0,0,0,0]
["AprtoJun12Orkney islandsTotals","Orkney islands","Totals","AprtoJun12",0,0,0,0,0,0,0,0,0,0,0,0]
["AprtoJun12Perth & KinrossCritical","Perth & Kinross","Critical","AprtoJun12",0,0,0,0,0,0,0,0,0,0,0,0]
["AprtoJun12Perth & KinrossSubstantial","Perth & Kinross","Substantial","AprtoJun12",0,0,0,0,0,0,0,0,0,0,0,0]
["AprtoJun12Perth & KinrossModerate","Perth & Kinross","Moderate","AprtoJun12",0,0,0,0,0,0,0,0,0,0,0,0]
["AprtoJun12Perth & KinrossLow or No Risk","Perth & Kinross","Low or No Risk","AprtoJun12",0,0,0,0,0,0,0,0,0,0,0,0]
["AprtoJun12Perth & KinrossNot available","Perth & Kinross","Not available","AprtoJun12",0,0,0,0,0,0,0,0,0,0,0,0]
["AprtoJun12Perth & KinrossTotals","Perth & Kinross","Totals","AprtoJun12",0,0,0,0,0,0,0,0,0,0,0,0]
["AprtoJun12RenfrewshireCritical","Renfrewshire","Critical","AprtoJun12",0.48,0.19,0.11,7.0000000000000007E-2,0.15,1,0.2,0.43,0.25,0.08,0.05,1]
["AprtoJun12RenfrewshireSubstantial","Renfrewshire","Substantial","AprtoJun12",0.3,0.15,0.13,0.08,0.35,1,0.42,0.38,0.04,0.04,0.13,1]
["AprtoJun12RenfrewshireModerate","Renfrewshire","Moderate","AprtoJun12",0.23,0.15,0.31,0.08,0.23,1,0.33,0,0.33,0.17,0.17,1]
["AprtoJun12RenfrewshireLow or No Risk","Renfrewshire","Low or No Risk","AprtoJun12",0.36,0.09,0.09,0,0.45,1,0,1,0,0,0,1]
["AprtoJun12RenfrewshireNot available","Renfrewshire","Not available","AprtoJun12",0.39,0.08,0.09,0.09,0.36,1,0.4,0.34,0.14000000000000001,0.03,0.09,1]
["AprtoJun12RenfrewshireTotals","Renfrewshire","Totals","AprtoJun12",0.37,0.11,0.11,0.08,0.33,1,0.32,0.37,0.17,0.06,0.08,1]
["AprtoJun12Scottish BordersCritical","Scottish Borders","Critical","AprtoJun12",0.2,0.25,0.16,0.13,0.26,1,0.1,0.62,0.12,0.15,0.02,1]
["AprtoJun12Scottish BordersSubstantial","Scottish Borders","Substantial","AprtoJun12",0.16,0.21,0.12,0.12,0.4,1,0.09,0.82,0,0,0.09,1]
["AprtoJun12Scottish BordersModerate","Scottish Borders","Moderate","AprtoJun12",0.13,0,0.13,0.25,0.5,1,0,0,0,0,0,0]
["AprtoJun12Scottish BordersLow or No Risk","Scottish Borders","Low or No Risk","AprtoJun12",0,0,0,0,1,1,0,0,0,0,0,0]
["AprtoJun12Scottish BordersNot available","Scottish Borders","Not available","AprtoJun12",0,0,0,0,0,0,0,0,0,0,0,0]
["AprtoJun12Scottish BordersTotals","Scottish Borders","Totals","AprtoJun12",0.19,0.23,0.14000000000000001,0.13,0.31,1,0.1,0.65,0.1,0.13,0.03,1]
["AprtoJun12Shetland islandsCritical","Shetland islands","Critical","AprtoJun12",0,0.5,0,0.33,0.17,1,0.11,0.89,0,0,0,1]
["AprtoJun12Shetland islandsSubstantial","Shetland islands","Substantial","AprtoJun12",0,0.67,0.33,0,0,1,0.42,0.5,0.08,0,0,1]
["AprtoJun12Shetland islandsModerate","Shetland islands","Moderate","AprtoJun12",0,0.33,0.33,0.33,0,1,0.5,0.5,0,0,0,1]
["AprtoJun12Shetland islandsLow or No Risk","Shetland islands","Low or No Risk","AprtoJun12",0,0,0,0,0,0,0,0,0,0,0,0]
["AprtoJun12Shetland islandsNot available","Shetland islands","Not available","AprtoJun12",0.13,0.46,0.17,0.21,0.04,1,0.13,0.63,0.25,0,0,1]
["AprtoJun12Shetland islandsTotals","Shetland islands","Totals","AprtoJun12",0.08,0.47,0.17,0.22,0.06,1,0.26,0.65,0.1,0,0,1]
["AprtoJun12South AyrshireCritical","South Ayrshire","Critical","AprtoJun12",0.31,0.44,0.25,0,0,1,0,0,0,0,0,0]
[{"$f":"D1156&B1156&C1156","v":"AprtoJun12South AyrshireSubstantial"},"South Ayrshire","Substantial","AprtoJun12",0.3,0.5,0.2,0,0,1,0,0,0,0,0,0]
["AprtoJun12South AyrshireModerate","South Ayrshire","Moderate","AprtoJun12",0.39,0.24,0.31,0.06,0,1,0,0,0,0,0,0]
["AprtoJun12South AyrshireLow or No Risk","South Ayrshire","Low or No Risk","AprtoJun12",0.18,0.52,0.3,0,0,1,0,0,0,0,0,0]
["AprtoJun12South AyrshireNot available","South Ayrshire","Not available","AprtoJun12",0,0,0,0,0,0,0,0,0,0,0,0]
["AprtoJun12South AyrshireTotals","South Ayrshire","Totals","AprtoJun12",0.28999999999999998,0.41,0.28000000000000003,0.02,0,1,0,0,0,0,0,0]
["AprtoJun12South LanarkshireCritical","South Lanarkshire","Critical","AprtoJun12",0,0,0,0,0,0,0,0,0,0,0,0]
["AprtoJun12South LanarkshireSubstantial","South Lanarkshire","Substantial","AprtoJun12",0,0,0,0,0,0,0,0,0,0,0,0]
["AprtoJun12South LanarkshireModerate","South Lanarkshire","Moderate","AprtoJun12",0,0,0,0,0,0,0,0,0,0,0,0]
["AprtoJun12South LanarkshireLow or No Risk","South Lanarkshire","Low or No Risk","AprtoJun12",0,0,0,0,0,0,0,0,0,0,0,0]
["AprtoJun12South LanarkshireNot available","South Lanarkshire","Not available","AprtoJun12",0,0,0,0,0,0,0,0,0,0,0,0]
["AprtoJun12South LanarkshireTotals","South Lanarkshire","Totals","AprtoJun12",0,0,0,0,0,0,0,0,0,0,0,0]
["AprtoJun12StirlingCritical","Stirling","Critical","AprtoJun12",0.77,0.13,0.05,0.02,0.05,1,0.06,0.85,0.09,0,0,1]
["AprtoJun12StirlingSubstantial","Stirling","Substantial","AprtoJun12",0.55000000000000004,0.1,0.03,0.01,0.31,1,0.14000000000000001,0.62,0.14000000000000001,0.05,0.05,1]
["AprtoJun12StirlingModerate","Stirling","Moderate","AprtoJun12",0.13,0,0,0,0.87,1,0.83,0.17,0,0,0,1]
["AprtoJun12StirlingLow or No Risk","Stirling","Low or No Risk","AprtoJun12",0,0,0,0,0,0,0,0,0,0,0,0]
["AprtoJun12StirlingNot available","Stirling","Not available","AprtoJun12",0.33,0.21,0.19,0.02,0.26,1,0.3,0.4,0.3,0,0,1]
["AprtoJun12StirlingTotals","Stirling","Totals","AprtoJun12",0.54,0.12,7.0000000000000007E-2,0.02,0.25,1,0.17,0.69,0.12,0.01,0.01,1]
["AprtoJun12West DunbartonshireCritical","West Dunbartonshire","Critical","AprtoJun12",0.74,0.06,0.09,0.09,0.03,1,0.81,0.19,0,0,0,1]
["AprtoJun12West DunbartonshireSubstantial","West Dunbartonshire","Substantial","AprtoJun12",0,0.54,0.13,0.04,0.28999999999999998,1,0.72,0.24,0.01,0.03,0,1]
["AprtoJun12West DunbartonshireModerate","West Dunbartonshire","Moderate","AprtoJun12",0,0,0.45,0.27,0.27,1,0.69,0.16,0.03,0.03,0.09,1]
["AprtoJun12West DunbartonshireLow or No Risk","West Dunbartonshire","Low or No Risk","AprtoJun12",0,0,0,0,1,1,0.46,0.15,0.08,0.08,0.23,1]
["AprtoJun12West DunbartonshireNot available","West Dunbartonshire","Not available","AprtoJun12",0,0,0,0,0,0,0,0,0,0,0,0]
["AprtoJun12West DunbartonshireTotals","West Dunbartonshire","Totals","AprtoJun12",0.3,0.18,0.19,0.12,0.2,1,0.7,0.21,0.02,0.03,0.04,1]
["AprtoJun12West LothianCritical","West Lothian","Critical","AprtoJun12",0.14000000000000001,0.43,0.2,0.11,0.11,1,0.22,0.56000000000000005,0.13,0.06,0.03,1]
["AprtoJun12West LothianSubstantial","West Lothian","Substantial","AprtoJun12",0.13,0.23,0.32,0.1,0.23,1,0.34,0.47,0.08,0.05,0.05,1]
["AprtoJun12West LothianModerate","West Lothian","Moderate","AprtoJun12",0.12,0.06,0.41,0.24,0.18,1,0.42,0.33,0.25,0,0,1]
["AprtoJun12West LothianLow or No Risk","West Lothian","Low or No Risk","AprtoJun12",0.31,0.19,0.25,0,0.25,1,0,0.8,0.2,0,0,1]
["AprtoJun12West LothianNot available","West Lothian","Not available","AprtoJun12",0.23,0.56999999999999995,0.13,0.03,0.03,1,1,0,0,0,0,1]
["AprtoJun12West LothianTotals","West Lothian","Totals","AprtoJun12",0.18,0.33,0.25,0.09,0.15,1,0.28000000000000003,0.52,0.13,0.05,0.03,1]
["AprtoJun12SCOTLAND TOTALSCritical","SCOTLAND TOTALS","Critical","AprtoJun12",0.36,0.28000000000000003,0.14000000000000001,0.06,0.15,1,0.36,0.49,7.0000000000000007E-2,0.03,0.03,1]
["AprtoJun12SCOTLAND TOTALSSubstantial","SCOTLAND TOTALS","Substantial","AprtoJun12",0.24,0.23,0.15,0.09,0.28999999999999998,1,0.24,0.64,0.05,0.02,0.04,1]
["AprtoJun12SCOTLAND TOTALSModerate","SCOTLAND TOTALS","Moderate","AprtoJun12",0.16,0.19,0.15,0.12,0.37,1,0.21,0.65,0.05,0.03,0.06,1]
["AprtoJun12SCOTLAND TOTALSLow or No Risk","SCOTLAND TOTALS","Low or No Risk","AprtoJun12",0.27,0.23,0.14000000000000001,0.08,0.28000000000000003,1,0.11,0.76,0.04,0.03,0.05,1]
["AprtoJun12SCOTLAND TOTALSNot available","SCOTLAND TOTALS","Not available","AprtoJun12",0.14000000000000001,0.26,0.18,0.14000000000000001,0.28999999999999998,1,0.12,0.7,0.12,0.04,0.02,1]
["AprtoJun12SCOTLAND TOTALSTotals","SCOTLAND TOTALS","Totals","AprtoJun12",0.22,0.24,0.16,0.11,0.28000000000000003,1,0.22,0.64,0.08,0.03,0.04,1]
["JultoSep12Aberdeen CityCritical","Aberdeen City","Critical","JultoSep12",0.12,0.46,0.19,0.12,0.12,1,0.33,0.53,0.13,0,0,1]
["JultoSep12Aberdeen CitySubstantial","Aberdeen City","Substantial","JultoSep12",0.15,0.22,0.22,0.09,0.31,1,0.28999999999999998,0.53,0.18,0,0,1]
["JultoSep12Aberdeen CityModerate","Aberdeen City","Moderate","JultoSep12",0.21,7.0000000000000007E-2,0.21,0.21,0.28999999999999998,1,0,0,0.33,0.67,0,1]
["JultoSep12Aberdeen CityLow or No Risk","Aberdeen City","Low or No Risk","JultoSep12",0,0,0.2,0.4,0.4,1,0,0,0,0,0,0]
["JultoSep12Aberdeen CityNot available","Aberdeen City","Not available","JultoSep12",0.33,0.33,0,0,0.33,1,0,0,0,0,0,0]
["JultoSep12Aberdeen CityTotals","Aberdeen City","Totals","JultoSep12",0.15,0.25,0.21,0.13,0.26,1,0.28999999999999998,0.49,0.17,0.06,0,1]
["JultoSep12AberdeenshireCritical","Aberdeenshire","Critical","JultoSep12",1,0,0,0,0,1,0,0,0,0,0,0]
["JultoSep12AberdeenshireSubstantial","Aberdeenshire","Substantial","JultoSep12",0.9,0.1,0,0,0,1,0,0,0,0,0,0]
["JultoSep12AberdeenshireModerate","Aberdeenshire","Moderate","JultoSep12",1,0,0,0,0,1,0,0,0,0,0,0]
["JultoSep12AberdeenshireLow or No Risk","Aberdeenshire","Low or No Risk","JultoSep12",0.92,0.08,0,0,0,1,0,0,0,0,0,0]
["JultoSep12AberdeenshireNot available","Aberdeenshire","Not available","JultoSep12",0.79,0.19,0.01,0.01,0.01,1,0,0,0,0,0,0]
["JultoSep12AberdeenshireTotals","Aberdeenshire","Totals","JultoSep12",0.81,0.17,0.01,0,0.01,1,0,0,0,0,0,0]
["JultoSep12AngusCritical","Angus","Critical","JultoSep12",0.03,0.26,0.21,0.08,0.44,1,0.56000000000000005,0.18,0.18,0.05,0.03,1]
["JultoSep12AngusSubstantial","Angus","Substantial","JultoSep12",0.24,0.12,0.2,0.1,0.33,1,0.34,0.57999999999999996,0.06,0,0.02,1]
["JultoSep12AngusModerate","Angus","Moderate","JultoSep12",0.42,0.16,0.11,0,0.32,1,0.24,0.76,0,0,0,1]
["JultoSep12AngusLow or No Risk","Angus","Low or No Risk","JultoSep12",0.36,0.2,0.11,0.1,0.23,1,0.02,0.98,0,0,0,1]
["JultoSep12AngusNot available","Angus","Not available","JultoSep12",0,0.17,0.17,0.17,0.5,1,0.4,0.4,0,0,0.2,1]
["JultoSep12AngusTotals","Angus","Totals","JultoSep12",0.24,0.18,0.16,0.09,0.33,1,0.28000000000000003,0.63,0.06,0.01,0.02,1]
["JultoSep12Argyll & ButeCritical","Argyll & Bute","Critical","JultoSep12",0.28000000000000003,0.35,0.15,7.0000000000000007E-2,0.15,1,0.33,0.47,0.03,0.1,7.0000000000000007E-2,1]
["JultoSep12Argyll & ButeSubstantial","Argyll & Bute","Substantial","JultoSep12",0.18,0.41,0.25,0.02,0.14000000000000001,1,0.33,0.37,0.15,0.09,0.06,1]
["JultoSep12Argyll & ButeModerate","Argyll & Bute","Moderate","JultoSep12",0,1,0,0,0,1,0.2,0.4,0.4,0,0,1]
["JultoSep12Argyll & ButeLow or No Risk","Argyll & Bute","Low or No Risk","JultoSep12",0,1,0,0,0,1,1,0,0,0,0,1]
["JultoSep12Argyll & ButeNot available","Argyll & Bute","Not available","JultoSep12",0,0,0,0,0,0,0,0,0,0,0,0]
["JultoSep12Argyll & ButeTotals","Argyll & Bute","Totals","JultoSep12",0.22,0.39,0.2,0.04,0.14000000000000001,1,0.33,0.4,0.13,0.09,0.06,1]
["JultoSep12ClackmannanshireCritical","Clackmannanshire","Critical","JultoSep12",0,0,0,0,0,0,0,0,0,0,0,0]
["JultoSep12ClackmannanshireSubstantial","Clackmannanshire","Substantial","JultoSep12",7.0000000000000007E-2,0.64,7.0000000000000007E-2,0.14000000000000001,7.0000000000000007E-2,1,0,0,0,0,0,0]
["JultoSep12ClackmannanshireModerate","Clackmannanshire","Moderate","JultoSep12",0,0.33,0.11,0.28000000000000003,0.28000000000000003,1,0,0,0,0,0,0]
["JultoSep12ClackmannanshireLow or No Risk","Clackmannanshire","Low or No Risk","JultoSep12",0.03,0.04,0.14000000000000001,0.16,0.62,1,0,0,0,0,0,0]
["JultoSep12ClackmannanshireNot available","Clackmannanshire","Not available","JultoSep12",0,0,0,0,0,0,0.54,0.41,0.03,0.02,0,1]
[{"$f":"D1220&B1220&C1220","v":"JultoSep12ClackmannanshireTotals"},"Clackmannanshire","Totals","JultoSep12",0.03,0.18,0.13,0.18,0.49,1,0.54,0.41,0.03,0.02,0,1]
["JultoSep12Dumfries and GallowayCritical","Dumfries and Galloway","Critical","JultoSep12",0,0,0,0,0,0,0,0,0,0,0,0]
["JultoSep12Dumfries and GallowaySubstantial","Dumfries and Galloway","Substantial","JultoSep12",0,0,0,0,0,0,0,0,0,0,0,0]
["JultoSep12Dumfries and GallowayModerate","Dumfries and Galloway","Moderate","JultoSep12",0,0,0,0,0,0,0,0,0,0,0,0]
["JultoSep12Dumfries and GallowayLow or No Risk","Dumfries and Galloway","Low or No Risk","JultoSep12",0,0,0,0,0,0,0,0,0,0,0,0]
["JultoSep12Dumfries and GallowayNot available","Dumfries and Galloway","Not available","JultoSep12",0.13,0.35,0.2,0.14000000000000001,0.17,1,0.08,0.73,0.11,0.05,0.02,1]
["JultoSep12Dumfries and GallowayTotals","Dumfries and Galloway","Totals","JultoSep12",0.13,0.35,0.2,0.14000000000000001,0.17,1,0.08,0.73,0.11,0.05,0.02,1]
["JultoSep12Dundee CityCritical","Dundee City","Critical","JultoSep12",0.26,0.49,0.21,0.02,0.02,1,0.13,0.18,0.26,0.15,0.28000000000000003,1]
["JultoSep12Dundee CitySubstantial","Dundee City","Substantial","JultoSep12",0.2,0.46,0.09,0.04,0.22,1,0.12,0.14000000000000001,0.26,0.16,0.33,1]
["JultoSep12Dundee CityModerate","Dundee City","Moderate","JultoSep12",0.11,0.42,0.18,0.09,0.2,1,0.2,0.1,0.22,0.2,0.27,1]
["JultoSep12Dundee CityLow or No Risk","Dundee City","Low or No Risk","JultoSep12",0.08,0.35,0.13,0.15,0.28000000000000003,1,0.33,0.26,0.15,0.15,0.11,1]
["JultoSep12Dundee CityNot available","Dundee City","Not available","JultoSep12",0.5,0,0,0.5,0,1,0.23,0,0,0.15,0.62,1]
["JultoSep12Dundee CityTotals","Dundee City","Totals","JultoSep12",0.13,0.42,0.16,0.09,0.2,1,0.19,0.14000000000000001,0.21,0.17,0.28999999999999998,1]
["JultoSep12East AyrshireCritical","East Ayrshire","Critical","JultoSep12",0.62,0.25,0.11,0.02,0,1,0.53,0.22,0.15,0.1,0,1]
["JultoSep12East AyrshireSubstantial","East Ayrshire","Substantial","JultoSep12",0.23,0.26,0.23,0.18,0.11,1,0.51,0.41,0.06,0.02,0,1]
["JultoSep12East AyrshireModerate","East Ayrshire","Moderate","JultoSep12",0.15,0.2,0.3,0.11,0.24,1,0.48,0.39,7.0000000000000007E-2,7.0000000000000007E-2,0,1]
["JultoSep12East AyrshireLow or No Risk","East Ayrshire","Low or No Risk","JultoSep12",0.23,0.38,0,0.23,0.15,1,0.33,0.67,0,0,0,1]
["JultoSep12East AyrshireNot available","East Ayrshire","Not available","JultoSep12",0,0,0,0,0,0,0,0,0,0,0,0]
["JultoSep12East AyrshireTotals","East Ayrshire","Totals","JultoSep12",0.3,0.24,0.21,0.11,0.13,1,0.5,0.34,0.09,0.06,0,1]
["JultoSep12East DunbartonshireCritical","East Dunbartonshire","Critical","JultoSep12",0.75,0.25,0,0,0,1,0,1,0,0,0,1]
["JultoSep12East DunbartonshireSubstantial","East Dunbartonshire","Substantial","JultoSep12",0.69,0.15,0.08,0.06,0.03,1,0,0.97,0.03,0,0,1]
["JultoSep12East DunbartonshireModerate","East Dunbartonshire","Moderate","JultoSep12",0.26,0.37,0.05,0.13,0.18,1,0,1,0,0,0,1]
["JultoSep12East DunbartonshireLow or No Risk","East Dunbartonshire","Low or No Risk","JultoSep12",0,0.73,0,0.18,0.09,1,0,1,0,0,0,1]
["JultoSep12East DunbartonshireNot available","East Dunbartonshire","Not available","JultoSep12",0,0,0,0,0,0,0,0,0,0,0,0]
["JultoSep12East DunbartonshireTotals","East Dunbartonshire","Totals","JultoSep12",0.59,0.21,7.0000000000000007E-2,0.08,0.05,1,0,0.98,0.02,0,0,1]
["JultoSep12East LothianCritical","East Lothian","Critical","JultoSep12",0,0,0,0,0,0,0.75,0.25,0,0,0,1]
["JultoSep12East LothianSubstantial","East Lothian","Substantial","JultoSep12",0.24,0.26,0.22,0.09,0.19,1,0.35,0.48,0.13,0.05,0,1]
["JultoSep12East LothianModerate","East Lothian","Moderate","JultoSep12",0,0,0,0,0,0,0,0,0,0,0,0]
["JultoSep12East LothianLow or No Risk","East Lothian","Low or No Risk","JultoSep12",0,0,0,0,0,0,0,0,0,0,0,0]
["JultoSep12East LothianNot available","East Lothian","Not available","JultoSep12",0,0,0,0,0,0,0,0,0,0,0,0]
["JultoSep12East LothianTotals","East Lothian","Totals","JultoSep12",0.24,0.26,0.22,0.09,0.19,1,0.36,0.47,0.13,0.04,0,1]
["JultoSep12East RenfrewshireCritical","East Renfrewshire","Critical","JultoSep12",0.71,0.28999999999999998,0,0,0,1,0.05,0.76,0.19,0,0,1]
["JultoSep12East RenfrewshireSubstantial","East Renfrewshire","Substantial","JultoSep12",0.41,0.5,0.09,0,0,1,0,0.84,0.11,0.05,0,1]
["JultoSep12East RenfrewshireModerate","East Renfrewshire","Moderate","JultoSep12",0.3,0.7,0,0,0,1,0,0.93,0.03,0.03,0,1]
["JultoSep12East RenfrewshireLow or No Risk","East Renfrewshire","Low or No Risk","JultoSep12",1,0,0,0,0,1,0,1,0,0,0,1]
["JultoSep12East RenfrewshireNot available","East Renfrewshire","Not available","JultoSep12",0.54,0.46,0,0,0,1,0,1,0,0,0,1]
["JultoSep12East RenfrewshireTotals","East Renfrewshire","Totals","JultoSep12",0.48,0.49,0.03,0,0,1,0.01,0.89,0.08,0.02,0,1]
["JultoSep12Edinburgh, City ofCritical","Edinburgh, City of","Critical","JultoSep12",0,0,0,0,0,0,0,0,0,0,0,0]
["JultoSep12Edinburgh, City ofSubstantial","Edinburgh, City of","Substantial","JultoSep12",0,0,0,0,0,0,0,0,0,0,0,0]
["JultoSep12Edinburgh, City ofModerate","Edinburgh, City of","Moderate","JultoSep12",0,0,0,0,0,0,0,0,0,0,0,0]
["JultoSep12Edinburgh, City ofLow or No Risk","Edinburgh, City of","Low or No Risk","JultoSep12",0,0,0,0,0,0,0,0,0,0,0,0]
["JultoSep12Edinburgh, City ofNot available","Edinburgh, City of","Not available","JultoSep12",0.17,0.18,0.18,0.22,0.25,1,0.05,0.77,0.11,0.05,0.03,1]
["JultoSep12Edinburgh, City ofTotals","Edinburgh, City of","Totals","JultoSep12",0.17,0.18,0.18,0.22,0.25,1,0.05,0.77,0.11,0.05,0.03,1]
["JultoSep12Eilean SiarCritical","Eilean Siar","Critical","JultoSep12",0,1,0,0,0,1,1,0,0,0,0,1]
["JultoSep12Eilean SiarSubstantial","Eilean Siar","Substantial","JultoSep12",0.19,0.56999999999999995,0.14000000000000001,0,0.1,1,0.1,0.62,0.19,0,0.1,1]
["JultoSep12Eilean SiarModerate","Eilean Siar","Moderate","JultoSep12",0,1,0,0,0,1,0,1,0,0,0,1]
["JultoSep12Eilean SiarLow or No Risk","Eilean Siar","Low or No Risk","JultoSep12",0,0,0,0,0,0,0,0,0,0,0,0]
["JultoSep12Eilean SiarNot available","Eilean Siar","Not available","JultoSep12",0.4,0.3,0.3,0,0,1,0.1,0.7,0.1,0,0.1,1]
["JultoSep12Eilean SiarTotals","Eilean Siar","Totals","JultoSep12",0.24,0.52,0.18,0,0.06,1,0.12,0.64,0.15,0,0.09,1]
["JultoSep12FalkirkCritical","Falkirk","Critical","JultoSep12",0.56000000000000005,0.23,0,0.02,0.19,1,0.95,0.05,0,0,0,1]
["JultoSep12FalkirkSubstantial","Falkirk","Substantial","JultoSep12",0.19,0.32,0.05,0.08,0.36,1,0.85,0.12,0.03,0,0,1]
["JultoSep12FalkirkModerate","Falkirk","Moderate","JultoSep12",0.12,0.35,0.04,0.19,0.31,1,0.75,0.25,0,0,0,1]
["JultoSep12FalkirkLow or No Risk","Falkirk","Low or No Risk","JultoSep12",0,0.25,0.08,0,0.67,1,0,0,0,0,0,0]
["JultoSep12FalkirkNot available","Falkirk","Not available","JultoSep12",0,0,0,0,0,0,0,0,0,0,0,0]
["JultoSep12FalkirkTotals","Falkirk","Totals","JultoSep12",0.26,0.3,0.04,0.08,0.33,1,0.91,0.08,0.01,0,0,1]
["JultoSep12FifeCritical","Fife","Critical","JultoSep12",0,0,0,0,0,0,0,0,0,0,0,0]
["JultoSep12FifeSubstantial","Fife","Substantial","JultoSep12",0,0,0,0,0,0,0,0,0,0,0,0]
["JultoSep12FifeModerate","Fife","Moderate","JultoSep12",0,0,0,0,0,0,0,0,0,0,0,0]
["JultoSep12FifeLow or No Risk","Fife","Low or No Risk","JultoSep12",0,0,0,0,0,0,0,0,0,0,0,0]
["JultoSep12FifeNot available","Fife","Not available","JultoSep12",0,0,0,0,0,0,0,0,0,0,0,0]
["JultoSep12FifeTotals","Fife","Totals","JultoSep12",0,0,0,0,0,0,0,0,0,0,0,0]
["JultoSep12Glasgow CityCritical","Glasgow City","Critical","JultoSep12",0.02,0.16,0.14000000000000001,0.06,0.62,1,0,1,0,0,0,1]
["JultoSep12Glasgow CitySubstantial","Glasgow City","Substantial","JultoSep12",0.06,0.1,0.12,0.08,0.64,1,0,1,0,0,0,1]
["JultoSep12Glasgow CityModerate","Glasgow City","Moderate","JultoSep12",0.1,0.23,0.05,0.05,0.56999999999999995,1,0,1,0,0,0,1]
[{"$f":"D1284&B1284&C1284","v":"JultoSep12Glasgow CityLow or No Risk"},"Glasgow City","Low or No Risk","JultoSep12",0.14000000000000001,0.24,0.1,0.05,0.48,1,0,1,0,0,0,1]
["JultoSep12Glasgow CityNot available","Glasgow City","Not available","JultoSep12",0.14000000000000001,0.48,7.0000000000000007E-2,0.08,0.23,1,0,1,0,0,0,1]
["JultoSep12Glasgow CityTotals","Glasgow City","Totals","JultoSep12",0.09,0.25,0.09,7.0000000000000007E-2,0.5,1,0,1,0,0,0,1]
["JultoSep12HighlandCritical","Highland","Critical","JultoSep12",0.19,0.28000000000000003,0.16,0.13,0.22,1,0,0,0,0,0,0]
["JultoSep12HighlandSubstantial","Highland","Substantial","JultoSep12",0.24,0.17,0.17,0.09,0.33,1,0,0,0,0,0,0]
["JultoSep12HighlandModerate","Highland","Moderate","JultoSep12",0.08,0.17,0.21,0.04,0.51,1,0,0,0,0,0,0]
["JultoSep12HighlandLow or No Risk","Highland","Low or No Risk","JultoSep12",0,0.38,0.13,0.13,0.38,1,0,0,0,0,0,0]
["JultoSep12HighlandNot available","Highland","Not available","JultoSep12",0.05,0,0.17,0.12,0.66,1,0,0,0,0,0,0]
["JultoSep12HighlandTotals","Highland","Totals","JultoSep12",0.14000000000000001,0.18,0.18,0.1,0.4,1,0,0,0,0,0,0]
["JultoSep12InverclydeCritical","Inverclyde","Critical","JultoSep12",0,0.17,0.33,0.33,0.17,1,0.38,0.42,0.08,0.08,0.04,1]
["JultoSep12InverclydeSubstantial","Inverclyde","Substantial","JultoSep12",0.2,0.33,0.13,7.0000000000000007E-2,0.27,1,0.54,0.34,0.03,0.03,0.06,1]
["JultoSep12InverclydeModerate","Inverclyde","Moderate","JultoSep12",0.11,0.33,0.11,0.33,0.11,1,0.43,0.5,7.0000000000000007E-2,0,0,1]
["JultoSep12InverclydeLow or No Risk","Inverclyde","Low or No Risk","JultoSep12",0.13,0,0,0.38,0.5,1,0.33,0.67,0,0,0,1]
["JultoSep12InverclydeNot available","Inverclyde","Not available","JultoSep12",0.75,0.25,0,0,0,1,0.28999999999999998,0.71,0,0,0,1]
["JultoSep12InverclydeTotals","Inverclyde","Totals","JultoSep12",0.19,0.24,0.12,0.21,0.24,1,0.45,0.43,0.05,0.04,0.04,1]
["JultoSep12MidlothianCritical","Midlothian","Critical","JultoSep12",0,0,0,0,0,0,0,0,0,0,0,0]
["JultoSep12MidlothianSubstantial","Midlothian","Substantial","JultoSep12",0,0,0,0,0,0,0,0,0,0,0,0]
["JultoSep12MidlothianModerate","Midlothian","Moderate","JultoSep12",0,0,0,0,0,0,0,0,0,0,0,0]
["JultoSep12MidlothianLow or No Risk","Midlothian","Low or No Risk","JultoSep12",0,0,0,0,0,0,0,0,0,0,0,0]
["JultoSep12MidlothianNot available","Midlothian","Not available","JultoSep12",0,0.1,0.24,0.18,0.48,1,0,0,0,0,0,0]
["JultoSep12MidlothianTotals","Midlothian","Totals","JultoSep12",0,0.1,0.24,0.18,0.48,1,0,0,0,0,0,0]
["JultoSep12MorayCritical","Moray","Critical","JultoSep12",0,0,0,0,0,0,7.0000000000000007E-2,0.87,7.0000000000000007E-2,0,0,1]
["JultoSep12MoraySubstantial","Moray","Substantial","JultoSep12",0.36,0.41,0.13,0.08,0.03,1,0.08,0.74,0.14000000000000001,0.04,0,1]
["JultoSep12MorayModerate","Moray","Moderate","JultoSep12",0.13,0.47,0.2,0.17,0.03,1,0,1,0,0,0,1]
["JultoSep12MorayLow or No Risk","Moray","Low or No Risk","JultoSep12",1,0,0,0,0,1,0,0,0,0,0,0]
["JultoSep12MorayNot available","Moray","Not available","JultoSep12",0,0,0,0,0,0,0,0,0,0,0,0]
["JultoSep12MorayTotals","Moray","Totals","JultoSep12",0.3,0.41,0.15,0.11,0.03,1,0.08,0.76,0.13,0.03,0,1]
["JultoSep12North AyrshireCritical","North Ayrshire","Critical","JultoSep12",0.38,0.13,0.5,0,0,1,1,0,0,0,0,1]
["JultoSep12North AyrshireSubstantial","North Ayrshire","Substantial","JultoSep12",0.04,0.26,0.44,0.18,7.0000000000000007E-2,1,0.97,0.03,0,0,0,1]
["JultoSep12North AyrshireModerate","North Ayrshire","Moderate","JultoSep12",0,0.25,0.75,0,0,1,1,0,0,0,0,1]
["JultoSep12North AyrshireLow or No Risk","North Ayrshire","Low or No Risk","JultoSep12",0,0.43,0.43,0.14000000000000001,0,1,0,0,0,0,0,0]
["JultoSep12North AyrshireNot available","North Ayrshire","Not available","JultoSep12",0.2,0.6,0.2,0,0,1,0,0,0,0,0,0]
["JultoSep12North AyrshireTotals","North Ayrshire","Totals","JultoSep12",7.0000000000000007E-2,0.28000000000000003,0.45,0.15,0.05,1,0.98,0.03,0,0,0,1]
["JultoSep12North LanarkshireCritical","North Lanarkshire","Critical","JultoSep12",0.66,0.22,0.05,0.01,0.06,1,0.22,0.72,0.03,0.01,0.02,1]
["JultoSep12North LanarkshireSubstantial","North Lanarkshire","Substantial","JultoSep12",0.64,0.18,0.1,0.03,0.05,1,0.32,0.6,0.03,0.04,0.01,1]
["JultoSep12North LanarkshireModerate","North Lanarkshire","Moderate","JultoSep12",0.51,0.21,0.1,0.04,0.14000000000000001,1,0.45,0.5,0,0,0.05,1]
["JultoSep12North LanarkshireLow or No Risk","North Lanarkshire","Low or No Risk","JultoSep12",0.56999999999999995,0.33,0.04,0.01,0.06,1,0.45,0.35,0.1,0.1,0,1]
["JultoSep12North LanarkshireNot available","North Lanarkshire","Not available","JultoSep12",0,0,0,0,0,0,0,0,0,0,0,0]
["JultoSep12North LanarkshireTotals","North Lanarkshire","Totals","JultoSep12",0.6,0.23,7.0000000000000007E-2,0.02,0.08,1,0.28000000000000003,0.65,0.03,0.02,0.02,1]
["JultoSep12Orkney islandsCritical","Orkney islands","Critical","JultoSep12",0,0,0,0,0,0,0,0,0,0,0,0]
["JultoSep12Orkney islandsSubstantial","Orkney islands","Substantial","JultoSep12",0,0,0,0,0,0,0,0,0,0,0,0]
["JultoSep12Orkney islandsModerate","Orkney islands","Moderate","JultoSep12",0,0,0,0,0,0,0,0,0,0,0,0]
["JultoSep12Orkney islandsLow or No Risk","Orkney islands","Low or No Risk","JultoSep12",0,0,0,0,0,0,0,0,0,0,0,0]
["JultoSep12Orkney islandsNot available","Orkney islands","Not available","JultoSep12",0,0,0,0,0,0,0,0,0,0,0,0]
["JultoSep12Orkney islandsTotals","Orkney islands","Totals","JultoSep12",0,0,0,0,0,0,0,0,0,0,0,0]
["JultoSep12Perth & KinrossCritical","Perth & Kinross","Critical","JultoSep12",0,0,0,0,0,0,0,0,0,0,0,0]
["JultoSep12Perth & KinrossSubstantial","Perth & Kinross","Substantial","JultoSep12",0,0,0,0,0,0,0,0,0,0,0,0]
["JultoSep12Perth & KinrossModerate","Perth & Kinross","Moderate","JultoSep12",0,0,0,0,0,0,0,0,0,0,0,0]
["JultoSep12Perth & KinrossLow or No Risk","Perth & Kinross","Low or No Risk","JultoSep12",0,0,0,0,0,0,0,0,0,0,0,0]
["JultoSep12Perth & KinrossNot available","Perth & Kinross","Not available","JultoSep12",0,0,0,0,0,0,0,0,0,0,0,0]
["JultoSep12Perth & KinrossTotals","Perth & Kinross","Totals","JultoSep12",0,0,0,0,0,0,0,0,0,0,0,0]
["JultoSep12RenfrewshireCritical","Renfrewshire","Critical","JultoSep12",0.45,0.31,0.17,7.0000000000000007E-2,0,1,0.27,0.43,0.22,0.03,0.05,1]
["JultoSep12RenfrewshireSubstantial","Renfrewshire","Substantial","JultoSep12",0.37,0.14000000000000001,0.05,0.02,0.42,1,0.33,0.39,0.17,0.08,0.03,1]
["JultoSep12RenfrewshireModerate","Renfrewshire","Moderate","JultoSep12",0.22,0.11,0.11,0,0.56000000000000005,1,0.83,0,0,0,0.17,1]
["JultoSep12RenfrewshireLow or No Risk","Renfrewshire","Low or No Risk","JultoSep12",0,0.22,0,0.11,0.67,1,0,0,0,0,0,0]
["JultoSep12RenfrewshireNot available","Renfrewshire","Not available","JultoSep12",0.25,0.12,0.16,7.0000000000000007E-2,0.4,1,0.39,0.39,0.08,0.05,0.08,1]
["JultoSep12RenfrewshireTotals","Renfrewshire","Totals","JultoSep12",0.3,0.16,0.12,0.06,0.36,1,0.36,0.38,0.15,0.05,0.06,1]
["JultoSep12Scottish BordersCritical","Scottish Borders","Critical","JultoSep12",0.21,0.23,0.18,0.08,0.28999999999999998,1,0.16,0.62,0.11,7.0000000000000007E-2,0.03,1]
["JultoSep12Scottish BordersSubstantial","Scottish Borders","Substantial","JultoSep12",7.0000000000000007E-2,0.2,0.2,7.0000000000000007E-2,0.46,1,0,1,0,0,0,1]
["JultoSep12Scottish BordersModerate","Scottish Borders","Moderate","JultoSep12",0,0,0,0,1,1,0,0,0,0,0,0]
["JultoSep12Scottish BordersLow or No Risk","Scottish Borders","Low or No Risk","JultoSep12",0,0.5,0,0,0.5,1,0,0,0,0,0,0]
["JultoSep12Scottish BordersNot available","Scottish Borders","Not available","JultoSep12",0,0,0,0,0,0,0,0,0,0,0,0]
["JultoSep12Scottish BordersTotals","Scottish Borders","Totals","JultoSep12",0.17,0.22,0.18,0.08,0.35,1,0.15,0.66,0.1,0.06,0.03,1]
["JultoSep12Shetland islandsCritical","Shetland islands","Critical","JultoSep12",0,0.5,0.5,0,0,1,0.5,0.5,0,0,0,1]
[{"$f":"D1348&B1348&C1348","v":"JultoSep12Shetland islandsSubstantial"},"Shetland islands","Substantial","JultoSep12",0,1,0,0,0,1,0.21,0.79,0,0,0,1]
["JultoSep12Shetland islandsModerate","Shetland islands","Moderate","JultoSep12",0,1,0,0,0,1,0.2,0.6,0.2,0,0,1]
["JultoSep12Shetland islandsLow or No Risk","Shetland islands","Low or No Risk","JultoSep12",0,0,0,0,0,0,0,1,0,0,0,1]
["JultoSep12Shetland islandsNot available","Shetland islands","Not available","JultoSep12",0.05,0.38,0.33,0.15,0.08,1,0.4,0.6,0,0,0,1]
["JultoSep12Shetland islandsTotals","Shetland islands","Totals","JultoSep12",0.05,0.43,0.32,0.14000000000000001,7.0000000000000007E-2,1,0.3,0.67,0.03,0,0,1]
["JultoSep12South AyrshireCritical","South Ayrshire","Critical","JultoSep12",0.22,0.55000000000000004,0.14000000000000001,0.06,0.04,1,0,0,0,0,0,0]
["JultoSep12South AyrshireSubstantial","South Ayrshire","Substantial","JultoSep12",0.16,0.53,0.26,0.05,0,1,0,0,0,0,0,0]
["JultoSep12South AyrshireModerate","South Ayrshire","Moderate","JultoSep12",0.32,0.44,0.15,0.06,0.03,1,0,0,0,0,0,0]
["JultoSep12South AyrshireLow or No Risk","South Ayrshire","Low or No Risk","JultoSep12",0.19,0.38,0.37,0.06,0,1,0,0,0,0,0,0]
["JultoSep12South AyrshireNot available","South Ayrshire","Not available","JultoSep12",0,0,0,0,0,0,0,0,0,0,0,0]
["JultoSep12South AyrshireTotals","South Ayrshire","Totals","JultoSep12",0.22,0.46,0.24,0.06,0.02,1,0,0,0,0,0,0]
["JultoSep12South LanarkshireCritical","South Lanarkshire","Critical","JultoSep12",0,0,0,0,0,0,0,0,0,0,0,0]
["JultoSep12South LanarkshireSubstantial","South Lanarkshire","Substantial","JultoSep12",0,0,0,0,0,0,0,0,0,0,0,0]
["JultoSep12South LanarkshireModerate","South Lanarkshire","Moderate","JultoSep12",0,0,0,0,0,0,0,0,0,0,0,0]
["JultoSep12South LanarkshireLow or No Risk","South Lanarkshire","Low or No Risk","JultoSep12",0,0,0,0,0,0,0,0,0,0,0,0]
["JultoSep12South LanarkshireNot available","South Lanarkshire","Not available","JultoSep12",0,0,0,0,0,0,0,0,0,0,0,0]
["JultoSep12South LanarkshireTotals","South Lanarkshire","Totals","JultoSep12",0,0,0,0,0,0,0,0,0,0,0,0]
["JultoSep12StirlingCritical","Stirling","Critical","JultoSep12",0.84,0.02,0.06,0.05,0.03,1,0.15,0.67,0.15,0.04,0,1]
["JultoSep12StirlingSubstantial","Stirling","Substantial","JultoSep12",0.5,0.13,0.01,0.04,0.32,1,0.15,0.54,0.31,0,0,1]
["JultoSep12StirlingModerate","Stirling","Moderate","JultoSep12",0.4,7.0000000000000007E-2,0,0,0.53,1,0,1,0,0,0,1]
["JultoSep12StirlingLow or No Risk","Stirling","Low or No Risk","JultoSep12",0,0,0,0,0,0,0,0,0,0,0,0]
["JultoSep12StirlingNot available","Stirling","Not available","JultoSep12",0.26,0.21,0.13,0.17,0.23,1,0.28000000000000003,0.39,0.17,0.17,0,1]
["JultoSep12StirlingTotals","Stirling","Totals","JultoSep12",0.55000000000000004,0.11,0.06,7.0000000000000007E-2,0.22,1,0.18,0.59,0.18,0.06,0,1]
["JultoSep12West DunbartonshireCritical","West Dunbartonshire","Critical","JultoSep12",0.28999999999999998,0.17,0.08,0.15,0.31,1,0.33,0.25,0.25,0.08,0.08,1]
["JultoSep12West DunbartonshireSubstantial","West Dunbartonshire","Substantial","JultoSep12",0.2,0.28999999999999998,0.11,0.08,0.33,1,0.33,0.22,0.28000000000000003,0.17,0,1]
["JultoSep12West DunbartonshireModerate","West Dunbartonshire","Moderate","JultoSep12",0.04,0.13,0.33,0.21,0.28999999999999998,1,0.33,0.27,0.27,0.13,0,1]
["JultoSep12West DunbartonshireLow or No Risk","West Dunbartonshire","Low or No Risk","JultoSep12",0.04,0.11,7.0000000000000007E-2,0.09,0.69,1,0.35,0.28999999999999998,0.12,0.06,0.18,1]
["JultoSep12West DunbartonshireNot available","West Dunbartonshire","Not available","JultoSep12",0,0,0,0,0,0,0,0,0,0,0,0]
["JultoSep12West DunbartonshireTotals","West Dunbartonshire","Totals","JultoSep12",0.12,0.18,0.19,0.14000000000000001,0.37,1,0.34,0.26,0.23,0.12,0.05,1]
["JultoSep12West LothianCritical","West Lothian","Critical","JultoSep12",0.11,0.46,0.31,0.03,0.09,1,0.15,0.51,0.26,0.02,0.06,1]
["JultoSep12West LothianSubstantial","West Lothian","Substantial","JultoSep12",0.19,0.34,0.19,0.09,0.19,1,0.39,0.28000000000000003,0.08,0.14000000000000001,0.11,1]
["JultoSep12West LothianModerate","West Lothian","Moderate","JultoSep12",0.09,0.3,0.26,0.26,0.09,1,0.22,0.44,0.17,0.17,0,1]
["JultoSep12West LothianLow or No Risk","West Lothian","Low or No Risk","JultoSep12",0.36,0.36,0,7.0000000000000007E-2,0.21,1,0,0,0,0,0,0]
["JultoSep12West LothianNot available","West Lothian","Not available","JultoSep12",0.03,0.84,0.13,0,0,1,0,1,0,0,0,1]
["JultoSep12West LothianTotals","West Lothian","Totals","JultoSep12",0.13,0.48,0.2,0.08,0.1,1,0.25,0.42,0.18,0.09,7.0000000000000007E-2,1]
["JultoSep12SCOTLAND TOTALSCritical","SCOTLAND TOTALS","Critical","JultoSep12",0.38,0.26,0.13,0.06,0.18,1,0.38,0.45,0.1,0.04,0.03,1]
["JultoSep12SCOTLAND TOTALSSubstantial","SCOTLAND TOTALS","Substantial","JultoSep12",0.27,0.23,0.15,7.0000000000000007E-2,0.28000000000000003,1,0.25,0.61,0.08,0.03,0.02,1]
["JultoSep12SCOTLAND TOTALSModerate","SCOTLAND TOTALS","Moderate","JultoSep12",0.17,0.28000000000000003,0.15,0.09,0.3,1,0.22,0.6,0.08,0.06,0.04,1]
["JultoSep12SCOTLAND TOTALSLow or No Risk","SCOTLAND TOTALS","Low or No Risk","JultoSep12",0.24,0.26,0.12,0.1,0.28999999999999998,1,0.19,0.67,0.05,0.05,0.04,1]
["JultoSep12SCOTLAND TOTALSNot available","SCOTLAND TOTALS","Not available","JultoSep12",0.2,0.24,0.15,0.16,0.24,1,0.1,0.76,7.0000000000000007E-2,0.04,0.03,1]
["JultoSep12SCOTLAND TOTALSTotals","SCOTLAND TOTALS","Totals","JultoSep12",0.25,0.25,0.14000000000000001,0.1,0.26,1,0.23,0.62,0.08,0.04,0.03,1]
["OcttoDec12Aberdeen CityCritical","Aberdeen City","Critical","OcttoDec12",0.24,0.32,0.08,0.05,0.3,1,0.05,0.63,0.26,0.05,0,1]
["OcttoDec12Aberdeen CitySubstantial","Aberdeen City","Substantial","OcttoDec12",0.18,0.26,0.15,0.18,0.23,1,0.23,0.5,0.09,0.14000000000000001,0.05,1]
["OcttoDec12Aberdeen CityModerate","Aberdeen City","Moderate","OcttoDec12",0,0.1,0.2,0.1,0.6,1,0.5,0,0,0,0.5,1]
["OcttoDec12Aberdeen CityLow or No Risk","Aberdeen City","Low or No Risk","OcttoDec12",0,0.14000000000000001,0,0.14000000000000001,0.71,1,0,1,0,0,0,1]
["OcttoDec12Aberdeen CityNot available","Aberdeen City","Not available","OcttoDec12",1,0,0,0,0,1,0,0,0,0,0,0]
["OcttoDec12Aberdeen CityTotals","Aberdeen City","Totals","OcttoDec12",0.18,0.26,0.12,0.13,0.31,1,0.16,0.55000000000000004,0.16,0.09,0.05,1]
["OcttoDec12AberdeenshireCritical","Aberdeenshire","Critical","OcttoDec12",0.2,0.4,0.2,0.2,0,1,0,0,0,0,0,0]
["OcttoDec12AberdeenshireSubstantial","Aberdeenshire","Substantial","OcttoDec12",0.1,0.5,0.2,0,0.2,1,0,0,0,0,0,0]
["OcttoDec12AberdeenshireModerate","Aberdeenshire","Moderate","OcttoDec12",0,0,0.33,0.33,0.33,1,0,0,0,0,0,0]
["OcttoDec12AberdeenshireLow or No Risk","Aberdeenshire","Low or No Risk","OcttoDec12",0,0.44,0.22,0.22,0.11,1,0,0,0,0,0,0]
["OcttoDec12AberdeenshireNot available","Aberdeenshire","Not available","OcttoDec12",0.09,0.41,0.19,7.0000000000000007E-2,0.23,1,0,0,0,0,0,0]
["OcttoDec12AberdeenshireTotals","Aberdeenshire","Totals","OcttoDec12",0.09,0.41,0.2,0.08,0.22,1,0,0,0,0,0,0]
["OcttoDec12AngusCritical","Angus","Critical","OcttoDec12",0,0.22,0.22,0.22,0.33,1,0.3,0.35,0.1,0.1,0.15,1]
["OcttoDec12AngusSubstantial","Angus","Substantial","OcttoDec12",0.46,0.23,0.03,0.14000000000000001,0.14000000000000001,1,0.28999999999999998,0.61,0.04,0,0.06,1]
["OcttoDec12AngusModerate","Angus","Moderate","OcttoDec12",0.65,0.1,0.05,0,0.2,1,0.15,0.72,0.1,0,0.03,1]
["OcttoDec12AngusLow or No Risk","Angus","Low or No Risk","OcttoDec12",0.41,0.34,0.05,0.05,0.16,1,0.04,0.84,0.01,0.04,0.06,1]
["OcttoDec12AngusNot available","Angus","Not available","OcttoDec12",0,0.2,0,0.2,0.6,1,1,0,0,0,0,1]
["OcttoDec12AngusTotals","Angus","Totals","OcttoDec12",0.39,0.25,7.0000000000000007E-2,0.1,0.2,1,0.19,0.68,0.05,0.02,0.06,1]
["OcttoDec12Argyll & ButeCritical","Argyll & Bute","Critical","OcttoDec12",0.42,0.35,0.12,0.02,0.09,1,0.28999999999999998,0.37,0.21,0.11,0.03,1]
["OcttoDec12Argyll & ButeSubstantial","Argyll & Bute","Substantial","OcttoDec12",0.26,0.28999999999999998,0.16,0.11,0.19,1,0.28999999999999998,0.47,0.11,0.13,0,1]
["OcttoDec12Argyll & ButeModerate","Argyll & Bute","Moderate","OcttoDec12",0.35,0.12,0.12,0,0.41,1,0.88,0.13,0,0,0,1]
["OcttoDec12Argyll & ButeLow or No Risk","Argyll & Bute","Low or No Risk","OcttoDec12",0,0.13,0.13,0.25,0.5,1,0,0,0,0,0,0]
["OcttoDec12Argyll & ButeNot available","Argyll & Bute","Not available","OcttoDec12",0,0,0,0,0,0,1,0,0,0,0,1]
[{"$f":"D1412&B1412&C1412","v":"OcttoDec12Argyll & ButeTotals"},"Argyll & Bute","Totals","OcttoDec12",0.31,0.3,0.14000000000000001,7.0000000000000007E-2,0.18,1,0.36,0.38,0.14000000000000001,0.1,0.01,1]
["OcttoDec12ClackmannanshireCritical","Clackmannanshire","Critical","OcttoDec12",0,0,0,0,0,0,0,0,0,0,0,0]
["OcttoDec12ClackmannanshireSubstantial","Clackmannanshire","Substantial","OcttoDec12",0.27,0.41,0.14000000000000001,0,0.18,1,0,0,0,0,0,0]
["OcttoDec12ClackmannanshireModerate","Clackmannanshire","Moderate","OcttoDec12",0,0.22,0.28000000000000003,0.19,0.31,1,0,0,0,0,0,0]
["OcttoDec12ClackmannanshireLow or No Risk","Clackmannanshire","Low or No Risk","OcttoDec12",0.02,0.04,0.1,0.08,0.77,1,0,0,0,0,0,0]
["OcttoDec12ClackmannanshireNot available","Clackmannanshire","Not available","OcttoDec12",0,0,0,0,0,0,0.63,0.3,0.06,0.01,0,1]
["OcttoDec12ClackmannanshireTotals","Clackmannanshire","Totals","OcttoDec12",7.0000000000000007E-2,0.17,0.16,0.09,0.51,1,0.63,0.3,0.06,0.01,0,1]
["OcttoDec12Dumfries and GallowayCritical","Dumfries and Galloway","Critical","OcttoDec12",0,0,0,0,0,0,0,0,0,0,0,0]
["OcttoDec12Dumfries and GallowaySubstantial","Dumfries and Galloway","Substantial","OcttoDec12",0,0,0,0,0,0,0,0,0,0,0,0]
["OcttoDec12Dumfries and GallowayModerate","Dumfries and Galloway","Moderate","OcttoDec12",0,0,0,0,0,0,0,0,0,0,0,0]
["OcttoDec12Dumfries and GallowayLow or No Risk","Dumfries and Galloway","Low or No Risk","OcttoDec12",0,0,0,0,0,0,0,0,0,0,0,0]
["OcttoDec12Dumfries and GallowayNot available","Dumfries and Galloway","Not available","OcttoDec12",0.09,0.43,0.22,7.0000000000000007E-2,0.19,1,0.1,0.63,0.21,0.03,0.03,1]
["OcttoDec12Dumfries and GallowayTotals","Dumfries and Galloway","Totals","OcttoDec12",0.09,0.43,0.22,7.0000000000000007E-2,0.19,1,0.1,0.63,0.21,0.03,0.03,1]
["OcttoDec12Dundee CityCritical","Dundee City","Critical","OcttoDec12",0.09,0.59,0.14000000000000001,0.05,0.14000000000000001,1,0.04,0.32,0.19,0.12,0.32,1]
["OcttoDec12Dundee CitySubstantial","Dundee City","Substantial","OcttoDec12",0.17,0.33,0.17,0,0.33,1,0.09,0.44,0.12,0.15,0.21,1]
["OcttoDec12Dundee CityModerate","Dundee City","Moderate","OcttoDec12",0.08,0.37,0.12,0.04,0.39,1,0.04,0.46,0.11,0.19,0.19,1]
["OcttoDec12Dundee CityLow or No Risk","Dundee City","Low or No Risk","OcttoDec12",0.1,0.18,0.03,0.03,0.68,1,0.1,0.67,7.0000000000000007E-2,7.0000000000000007E-2,0.1,1]
["OcttoDec12Dundee CityNot available","Dundee City","Not available","OcttoDec12",0,1,0,0,0,1,0,0.33,0,0.33,0.33,1]
["OcttoDec12Dundee CityTotals","Dundee City","Totals","OcttoDec12",0.09,0.36,0.11,0.03,0.4,1,0.06,0.44,0.13,0.16,0.22,1]
["OcttoDec12East AyrshireCritical","East Ayrshire","Critical","OcttoDec12",0.67,0.22,0.06,0.03,0.03,1,0.6,0.1,0.23,7.0000000000000007E-2,0,1]
["OcttoDec12East AyrshireSubstantial","East Ayrshire","Substantial","OcttoDec12",0.18,0.43,0.1,0.12,0.18,1,0.5,0.36,0.14000000000000001,0,0,1]
["OcttoDec12East AyrshireModerate","East Ayrshire","Moderate","OcttoDec12",0.12,0.12,0.25,0.2,0.31,1,0.73,0.14000000000000001,0.1,0.02,0,1]
["OcttoDec12East AyrshireLow or No Risk","East Ayrshire","Low or No Risk","OcttoDec12",0.25,0.08,0.17,0.17,0.33,1,0,1,0,0,0,1]
["OcttoDec12East AyrshireNot available","East Ayrshire","Not available","OcttoDec12",0,0,0,0,0,0,0,0,0,0,0,0]
["OcttoDec12East AyrshireTotals","East Ayrshire","Totals","OcttoDec12",0.23,0.21,0.18,0.15,0.23,1,0.65,0.19,0.14000000000000001,0.03,0,1]
["OcttoDec12East DunbartonshireCritical","East Dunbartonshire","Critical","OcttoDec12",0.75,0.25,0,0,0,1,0,1,0,0,0,1]
["OcttoDec12East DunbartonshireSubstantial","East Dunbartonshire","Substantial","OcttoDec12",0.69,0.15,0.04,7.0000000000000007E-2,0.06,1,0,0.96,0.03,0.01,0,1]
["OcttoDec12East DunbartonshireModerate","East Dunbartonshire","Moderate","OcttoDec12",0.24,0.24,0.09,0,0.42,1,0,1,0,0,0,1]
["OcttoDec12East DunbartonshireLow or No Risk","East Dunbartonshire","Low or No Risk","OcttoDec12",0.2,0.1,0,0,0.7,1,0,1,0,0,0,1]
["OcttoDec12East DunbartonshireNot available","East Dunbartonshire","Not available","OcttoDec12",0.2,0.2,0.2,0.1,0.3,1,0,0,0,0,0,0]
["OcttoDec12East DunbartonshireTotals","East Dunbartonshire","Totals","OcttoDec12",0.57999999999999996,0.17,0.05,0.05,0.14000000000000001,1,0,0.96,0.03,0.01,0,1]
["OcttoDec12East LothianCritical","East Lothian","Critical","OcttoDec12",0,0,0,0,0,0,0,0,0,0,0,0]
["OcttoDec12East LothianSubstantial","East Lothian","Substantial","OcttoDec12",0.25,0.24,0.18,0.12,0.21,1,0.3,0.52,0.14000000000000001,0.03,0.01,1]
["OcttoDec12East LothianModerate","East Lothian","Moderate","OcttoDec12",0,0,0,0,0,0,0,0,0,0,0,0]
["OcttoDec12East LothianLow or No Risk","East Lothian","Low or No Risk","OcttoDec12",0,0,0,0,0,0,0,0,0,0,0,0]
["OcttoDec12East LothianNot available","East Lothian","Not available","OcttoDec12",0,0,0,0,0,0,0,0,0,0,0,0]
["OcttoDec12East LothianTotals","East Lothian","Totals","OcttoDec12",0.25,0.24,0.18,0.12,0.21,1,0.3,0.52,0.14000000000000001,0.03,0.01,1]
["OcttoDec12East RenfrewshireCritical","East Renfrewshire","Critical","OcttoDec12",0.55000000000000004,0.45,0,0,0,1,0,0.8,0.2,0,0,1]
["OcttoDec12East RenfrewshireSubstantial","East Renfrewshire","Substantial","OcttoDec12",0.44,0.38,0.15,0.03,0,1,0,0.95,0.05,0,0,1]
["OcttoDec12East RenfrewshireModerate","East Renfrewshire","Moderate","OcttoDec12",0,0.65,0.35,0,0,1,0.14000000000000001,0.71,0.14000000000000001,0,0,1]
["OcttoDec12East RenfrewshireLow or No Risk","East Renfrewshire","Low or No Risk","OcttoDec12",0,0,0,0,0,0,0,0,0,0,0,0]
["OcttoDec12East RenfrewshireNot available","East Renfrewshire","Not available","OcttoDec12",0.43,0.54,0.04,0,0,1,0,0.96,0.04,0,0,1]
["OcttoDec12East RenfrewshireTotals","East Renfrewshire","Totals","OcttoDec12",0.34,0.5,0.15,0.01,0,1,0.03,0.9,7.0000000000000007E-2,0,0,1]
["OcttoDec12Edinburgh, City ofCritical","Edinburgh, City of","Critical","OcttoDec12",0,0,0,0,0,0,0,0,0,0,0,0]
["OcttoDec12Edinburgh, City ofSubstantial","Edinburgh, City of","Substantial","OcttoDec12",0,0,0,0,0,0,0,0,0,0,0,0]
["OcttoDec12Edinburgh, City ofModerate","Edinburgh, City of","Moderate","OcttoDec12",0,0,0,0,0,0,0,0,0,0,0,0]
["OcttoDec12Edinburgh, City ofLow or No Risk","Edinburgh, City of","Low or No Risk","OcttoDec12",0,0,0,0,0,0,0,0,0,0,0,0]
["OcttoDec12Edinburgh, City ofNot available","Edinburgh, City of","Not available","OcttoDec12",0.2,0.28000000000000003,0.23,0.13,0.17,1,0.01,0.73,0.14000000000000001,0.08,0.04,1]
["OcttoDec12Edinburgh, City ofTotals","Edinburgh, City of","Totals","OcttoDec12",0.2,0.28000000000000003,0.23,0.13,0.17,1,0.01,0.73,0.14000000000000001,0.08,0.04,1]
["OcttoDec12Eilean SiarCritical","Eilean Siar","Critical","OcttoDec12",0,1,0,0,0,1,0,1,0,0,0,1]
["OcttoDec12Eilean SiarSubstantial","Eilean Siar","Substantial","OcttoDec12",0,0.63,0,0.25,0.13,1,0,0.63,0.13,0,0.25,1]
["OcttoDec12Eilean SiarModerate","Eilean Siar","Moderate","OcttoDec12",0,0,0,0,0,0,0,0,0,0,0,0]
["OcttoDec12Eilean SiarLow or No Risk","Eilean Siar","Low or No Risk","OcttoDec12",0,0,0,0,0,0,0,0,0,0,0,0]
["OcttoDec12Eilean SiarNot available","Eilean Siar","Not available","OcttoDec12",0,0.54,0.23,0.23,0,1,0.23,0.46,0.15,0,0.15,1]
["OcttoDec12Eilean SiarTotals","Eilean Siar","Totals","OcttoDec12",0,0.59,0.14000000000000001,0.23,0.05,1,0.14000000000000001,0.55000000000000004,0.14000000000000001,0,0.18,1]
["OcttoDec12FalkirkCritical","Falkirk","Critical","OcttoDec12",0.25,0.33,0.08,0.05,0.28999999999999998,1,1,0,0,0,0,1]
["OcttoDec12FalkirkSubstantial","Falkirk","Substantial","OcttoDec12",0.15,0.31,0.03,0.06,0.45,1,0.93,7.0000000000000007E-2,0,0,0,1]
["OcttoDec12FalkirkModerate","Falkirk","Moderate","OcttoDec12",0.21,0.17,0.1,0.06,0.46,1,0.8,0.2,0,0,0,1]
["OcttoDec12FalkirkLow or No Risk","Falkirk","Low or No Risk","OcttoDec12",0,0,0.14000000000000001,0.14000000000000001,0.71,1,1,0,0,0,0,1]
["OcttoDec12FalkirkNot available","Falkirk","Not available","OcttoDec12",0,0,0,0,0,0,0,0,0,0,0,0]
["OcttoDec12FalkirkTotals","Falkirk","Totals","OcttoDec12",0.19,0.28000000000000003,0.06,0.06,0.42,1,0.98,0.02,0,0,0,1]
["OcttoDec12FifeCritical","Fife","Critical","OcttoDec12",0.13,0.68,0.12,0.02,0.04,1,0,0.62,0.19,0.03,0.16,1]
["OcttoDec12FifeSubstantial","Fife","Substantial","OcttoDec12",7.0000000000000007E-2,0.34,0.26,0.13,0.21,1,0.05,0.5,0.2,0.14000000000000001,0.11,1]
["OcttoDec12FifeModerate","Fife","Moderate","OcttoDec12",0.02,0.17,0.22,0.21,0.38,1,0,0.59,0.12,0.18,0.12,1]
[{"$f":"D1476&B1476&C1476","v":"OcttoDec12FifeLow or No Risk"},"Fife","Low or No Risk","OcttoDec12",0,0,7.0000000000000007E-2,0.1,0.83,1,0,0.5,0.5,0,0,1]
["OcttoDec12FifeNot available","Fife","Not available","OcttoDec12",0.1,0.47,0.2,0.08,0.14000000000000001,1,7.0000000000000007E-2,0.59,0.19,0.11,0.04,1]
["OcttoDec12FifeTotals","Fife","Totals","OcttoDec12",7.0000000000000007E-2,0.35,0.22,0.13,0.24,1,0.04,0.52,0.2,0.12,0.11,1]
["OcttoDec12Glasgow CityCritical","Glasgow City","Critical","OcttoDec12",0.02,0.16,0.15,0.06,0.62,1,0,1,0,0,0,1]
["OcttoDec12Glasgow CitySubstantial","Glasgow City","Substantial","OcttoDec12",0.06,0.1,0.12,0.08,0.64,1,0,1,0,0,0,1]
["OcttoDec12Glasgow CityModerate","Glasgow City","Moderate","OcttoDec12",0.1,0.23,0.05,0.05,0.56999999999999995,1,0,1,0,0,0,1]
["OcttoDec12Glasgow CityLow or No Risk","Glasgow City","Low or No Risk","OcttoDec12",0.13,0.26,0.09,0.04,0.48,1,0,1,0,0,0,1]
["OcttoDec12Glasgow CityNot available","Glasgow City","Not available","OcttoDec12",0.14000000000000001,0.48,7.0000000000000007E-2,0.08,0.23,1,0,1,0,0,0,1]
["OcttoDec12Glasgow CityTotals","Glasgow City","Totals","OcttoDec12",0.09,0.25,0.09,7.0000000000000007E-2,0.5,1,0,1,0,0,0,1]
["OcttoDec12HighlandCritical","Highland","Critical","OcttoDec12",0.09,0.3,0.28000000000000003,0.06,0.26,1,0,0,0,0,0,0]
["OcttoDec12HighlandSubstantial","Highland","Substantial","OcttoDec12",0.09,0.22,0.17,0.2,0.33,1,0,0,0,0,0,0]
["OcttoDec12HighlandModerate","Highland","Moderate","OcttoDec12",0.12,0.26,0.18,0.1,0.34,1,0,0,0,0,0,0]
["OcttoDec12HighlandLow or No Risk","Highland","Low or No Risk","OcttoDec12",0,0.14000000000000001,0.28999999999999998,0,0.56999999999999995,1,0,0,0,0,0,0]
["OcttoDec12HighlandNot available","Highland","Not available","OcttoDec12",7.0000000000000007E-2,0.27,0.15,0.05,0.46,1,0,0,0,0,0,0]
["OcttoDec12HighlandTotals","Highland","Totals","OcttoDec12",0.09,0.26,0.2,0.1,0.35,1,0,0,0,0,0,0]
["OcttoDec12InverclydeCritical","Inverclyde","Critical","OcttoDec12",0.2,0.2,0,0.4,0.2,1,0.24,0.28000000000000003,0.28000000000000003,0.04,0.16,1]
["OcttoDec12InverclydeSubstantial","Inverclyde","Substantial","OcttoDec12",0.1,0.3,0.2,0.3,0.1,1,0.7,0.27,0,0.03,0,1]
["OcttoDec12InverclydeModerate","Inverclyde","Moderate","OcttoDec12",0,0.13,0.44,0.13,0.31,1,0.83,0.11,0,0.06,0,1]
["OcttoDec12InverclydeLow or No Risk","Inverclyde","Low or No Risk","OcttoDec12",0.09,0.18,0.09,0.18,0.45,1,0,1,0,0,0,1]
["OcttoDec12InverclydeNot available","Inverclyde","Not available","OcttoDec12",0.38,0.13,0.25,0.13,0.13,1,1,0,0,0,0,1]
["OcttoDec12InverclydeTotals","Inverclyde","Totals","OcttoDec12",0.12,0.18,0.24,0.2,0.26,1,0.56999999999999995,0.25,0.09,0.04,0.05,1]
["OcttoDec12MidlothianCritical","Midlothian","Critical","OcttoDec12",0,0,0,0,0,0,0,0,0,0,0,0]
["OcttoDec12MidlothianSubstantial","Midlothian","Substantial","OcttoDec12",0,0,0,0,0,0,0,0,0,0,0,0]
["OcttoDec12MidlothianModerate","Midlothian","Moderate","OcttoDec12",0,0,0,0,0,0,0,0,0,0,0,0]
["OcttoDec12MidlothianLow or No Risk","Midlothian","Low or No Risk","OcttoDec12",0,0,0,0,0,0,0,0,0,0,0,0]
["OcttoDec12MidlothianNot available","Midlothian","Not available","OcttoDec12",0.01,0.14000000000000001,0.23,0.15,0.46,1,0,0,0,0,0,0]
["OcttoDec12MidlothianTotals","Midlothian","Totals","OcttoDec12",0.01,0.14000000000000001,0.23,0.15,0.46,1,0,0,0,0,0,0]
["OcttoDec12MorayCritical","Moray","Critical","OcttoDec12",1,0,0,0,0,1,0.06,0.63,0.31,0,0,1]
["OcttoDec12MoraySubstantial","Moray","Substantial","OcttoDec12",0.4,0.28999999999999998,0.13,0.15,0.02,1,0.5,0.43,0.06,0.01,0,1]
["OcttoDec12MorayModerate","Moray","Moderate","OcttoDec12",0.21,0.28000000000000003,0.28999999999999998,0.09,0.14000000000000001,1,0,1,0,0,0,1]
["OcttoDec12MorayLow or No Risk","Moray","Low or No Risk","OcttoDec12",0,0.2,0.6,0,0.2,1,0,0,0,0,0,0]
["OcttoDec12MorayNot available","Moray","Not available","OcttoDec12",0.25,0.25,0.5,0,0,1,0,0,0,0,0,0]
["OcttoDec12MorayTotals","Moray","Totals","OcttoDec12",0.3,0.28000000000000003,0.23,0.11,0.08,1,0.43,0.47,0.1,0.01,0,1]
["OcttoDec12North AyrshireCritical","North Ayrshire","Critical","OcttoDec12",0,0.22,0.22,0.11,0.44,1,1,0,0,0,0,1]
["OcttoDec12North AyrshireSubstantial","North Ayrshire","Substantial","OcttoDec12",0,0.26,0.33,0.22,0.19,1,1,0,0,0,0,1]
["OcttoDec12North AyrshireModerate","North Ayrshire","Moderate","OcttoDec12",0,0.25,0,0.25,0.5,1,0,0,0,0,0,0]
["OcttoDec12North AyrshireLow or No Risk","North Ayrshire","Low or No Risk","OcttoDec12",0,1,0,0,0,1,0,0,0,0,0,0]
["OcttoDec12North AyrshireNot available","North Ayrshire","Not available","OcttoDec12",0.5,0.5,0,0,0,1,0,0,0,0,0,0]
["OcttoDec12North AyrshireTotals","North Ayrshire","Totals","OcttoDec12",0.02,0.33,0.24,0.17,0.24,1,1,0,0,0,0,1]
["OcttoDec12North LanarkshireCritical","North Lanarkshire","Critical","OcttoDec12",0.68,0.21,0.06,0.02,0.04,1,0.19,0.73,0.06,0.02,0.01,1]
["OcttoDec12North LanarkshireSubstantial","North Lanarkshire","Substantial","OcttoDec12",0.43,0.28999999999999998,0.11,0.03,0.14000000000000001,1,0.37,0.53,0.04,0,0.05,1]
["OcttoDec12North LanarkshireModerate","North Lanarkshire","Moderate","OcttoDec12",0.52,0.23,0.05,0.02,0.18,1,0.43,0.43,0.08,0,0.06,1]
["OcttoDec12North LanarkshireLow or No Risk","North Lanarkshire","Low or No Risk","OcttoDec12",0.48,0.32,7.0000000000000007E-2,0.04,0.1,1,0.45,0.36,0.05,0.09,0.05,1]
["OcttoDec12North LanarkshireNot available","North Lanarkshire","Not available","OcttoDec12",0,0,0,0,0,0,0,0,0,0,0,0]
["OcttoDec12North LanarkshireTotals","North Lanarkshire","Totals","OcttoDec12",0.55000000000000004,0.25,7.0000000000000007E-2,0.02,0.1,1,0.28000000000000003,0.62,0.06,0.02,0.03,1]
["OcttoDec12Orkney islandsCritical","Orkney islands","Critical","OcttoDec12",0,0,0,0,0,0,0,0,0,0,0,0]
["OcttoDec12Orkney islandsSubstantial","Orkney islands","Substantial","OcttoDec12",0,0,0,0,0,0,0,0,0,0,0,0]
["OcttoDec12Orkney islandsModerate","Orkney islands","Moderate","OcttoDec12",0,0,0,0,0,0,0,0,0,0,0,0]
["OcttoDec12Orkney islandsLow or No Risk","Orkney islands","Low or No Risk","OcttoDec12",0,0,0,0,0,0,0,0,0,0,0,0]
["OcttoDec12Orkney islandsNot available","Orkney islands","Not available","OcttoDec12",0,0,0,0,0,0,0,0,0,0,0,0]
["OcttoDec12Orkney islandsTotals","Orkney islands","Totals","OcttoDec12",0,0,0,0,0,0,0,0,0,0,0,0]
["OcttoDec12Perth & KinrossCritical","Perth & Kinross","Critical","OcttoDec12",0.5,0.5,0,0,0,1,0,1,0,0,0,1]
["OcttoDec12Perth & KinrossSubstantial","Perth & Kinross","Substantial","OcttoDec12",0.37,0.26,0.17,0.09,0.11,1,0,0.92,0.08,0,0,1]
["OcttoDec12Perth & KinrossModerate","Perth & Kinross","Moderate","OcttoDec12",0.19,0.21,0.33,0.11,0.15,1,0,0.93,0,0,7.0000000000000007E-2,1]
["OcttoDec12Perth & KinrossLow or No Risk","Perth & Kinross","Low or No Risk","OcttoDec12",0.14000000000000001,0,0.43,0,0.43,1,0,0,0,0,0,0]
["OcttoDec12Perth & KinrossNot available","Perth & Kinross","Not available","OcttoDec12",0.34,0.28999999999999998,0.2,0.09,0.09,1,0,0.88,0,0,0.13,1]
["OcttoDec12Perth & KinrossTotals","Perth & Kinross","Totals","OcttoDec12",0.27,0.24,0.26,0.1,0.13,1,0,0.92,0.03,0,0.06,1]
["OcttoDec12RenfrewshireCritical","Renfrewshire","Critical","OcttoDec12",0.6,0.24,0.04,0.08,0.04,1,0.33,0.41,0.1,0.11,0.05,1]
["OcttoDec12RenfrewshireSubstantial","Renfrewshire","Substantial","OcttoDec12",0.39,0.2,0.09,0.05,0.27,1,0.48,0.26,0.15,7.0000000000000007E-2,0.04,1]
["OcttoDec12RenfrewshireModerate","Renfrewshire","Moderate","OcttoDec12",0.57999999999999996,0.08,0.17,0,0.17,1,0.71,0.14000000000000001,0.14000000000000001,0,0,1]
["OcttoDec12RenfrewshireLow or No Risk","Renfrewshire","Low or No Risk","OcttoDec12",0,0,0,0,1,1,0,0,0,0,0,0]
["OcttoDec12RenfrewshireNot available","Renfrewshire","Not available","OcttoDec12",0.33,0.11,0.17,0.03,0.36,1,0.43,0.27,0.11,0.08,0.11,1]
["OcttoDec12RenfrewshireTotals","Renfrewshire","Totals","OcttoDec12",0.4,0.15,0.13,0.04,0.28999999999999998,1,0.41,0.33,0.11,0.09,0.06,1]
["OcttoDec12Scottish BordersCritical","Scottish Borders","Critical","OcttoDec12",0.16,0.32,0.17,0.08,0.27,1,0.1,0.67,0.1,7.0000000000000007E-2,7.0000000000000007E-2,1]
[{"$f":"D1540&B1540&C1540","v":"OcttoDec12Scottish BordersSubstantial"},"Scottish Borders","Substantial","OcttoDec12",0.08,0.17,0.13,0.09,0.53,1,0,0.25,0.25,0.5,0,1]
["OcttoDec12Scottish BordersModerate","Scottish Borders","Moderate","OcttoDec12",0.33,0,0,0.17,0.5,1,1,0,0,0,0,1]
["OcttoDec12Scottish BordersLow or No Risk","Scottish Borders","Low or No Risk","OcttoDec12",0,0,0,0,0,0,0,0,0,0,0,0]
["OcttoDec12Scottish BordersNot available","Scottish Borders","Not available","OcttoDec12",0,0,0,0,0,0,0,0,0,0,0,0]
["OcttoDec12Scottish BordersTotals","Scottish Borders","Totals","OcttoDec12",0.14000000000000001,0.27,0.15,0.08,0.35,1,0.11,0.62,0.11,0.11,0.06,1]
["OcttoDec12Shetland islandsCritical","Shetland islands","Critical","OcttoDec12",0.33,0.5,0,0.17,0,1,0.2,0.6,0.2,0,0,1]
["OcttoDec12Shetland islandsSubstantial","Shetland islands","Substantial","OcttoDec12",0,0.5,0,0,0.5,1,0.14000000000000001,0.86,0,0,0,1]
["OcttoDec12Shetland islandsModerate","Shetland islands","Moderate","OcttoDec12",0,0,0,0,0,0,0.5,0.5,0,0,0,1]
["OcttoDec12Shetland islandsLow or No Risk","Shetland islands","Low or No Risk","OcttoDec12",1,0,0,0,0,1,1,0,0,0,0,1]
["OcttoDec12Shetland islandsNot available","Shetland islands","Not available","OcttoDec12",0.14000000000000001,0.39,0.25,0.11,0.11,1,0.5,0.5,0,0,0,1]
["OcttoDec12Shetland islandsTotals","Shetland islands","Totals","OcttoDec12",0.21,0.39,0.18,0.11,0.11,1,0.27,0.67,0.06,0,0,1]
["OcttoDec12South AyrshireCritical","South Ayrshire","Critical","OcttoDec12",0,0,0,0,0,0,0,0,0,0,0,0]
["OcttoDec12South AyrshireSubstantial","South Ayrshire","Substantial","OcttoDec12",0,0,0,0,0,0,0,0,0,0,0,0]
["OcttoDec12South AyrshireModerate","South Ayrshire","Moderate","OcttoDec12",0,0,0,0,0,0,0,0,0,0,0,0]
["OcttoDec12South AyrshireLow or No Risk","South Ayrshire","Low or No Risk","OcttoDec12",0,0,0,0,0,0,0,0,0,0,0,0]
["OcttoDec12South AyrshireNot available","South Ayrshire","Not available","OcttoDec12",0,0,0,0,0,0,0,0,0,0,0,0]
["OcttoDec12South AyrshireTotals","South Ayrshire","Totals","OcttoDec12",0,0,0,0,0,0,0,0,0,0,0,0]
["OcttoDec12South LanarkshireCritical","South Lanarkshire","Critical","OcttoDec12",0,0,0,0,0,0,0,0,0,0,0,0]
["OcttoDec12South LanarkshireSubstantial","South Lanarkshire","Substantial","OcttoDec12",0,0,0,0,0,0,0,0,0,0,0,0]
["OcttoDec12South LanarkshireModerate","South Lanarkshire","Moderate","OcttoDec12",0,0,0,0,0,0,0,0,0,0,0,0]
["OcttoDec12South LanarkshireLow or No Risk","South Lanarkshire","Low or No Risk","OcttoDec12",0,0,0,0,0,0,0,0,0,0,0,0]
["OcttoDec12South LanarkshireNot available","South Lanarkshire","Not available","OcttoDec12",0,0,0,0,0,0,0,0,0,0,0,0]
["OcttoDec12South LanarkshireTotals","South Lanarkshire","Totals","OcttoDec12",0,0,0,0,0,0,0,0,0,0,0,0]
["OcttoDec12StirlingCritical","Stirling","Critical","OcttoDec12",0.78,0.12,0,0.02,0.08,1,0.21,0.47,0.14000000000000001,0.19,0,1]
["OcttoDec12StirlingSubstantial","Stirling","Substantial","OcttoDec12",0.42,0.23,0.05,0.06,0.25,1,7.0000000000000007E-2,0.71,0.14000000000000001,7.0000000000000007E-2,0,1]
["OcttoDec12StirlingModerate","Stirling","Moderate","OcttoDec12",0,0,0,0.17,0.83,1,0,1,0,0,0,1]
["OcttoDec12StirlingLow or No Risk","Stirling","Low or No Risk","OcttoDec12",0,0,0,0,0,0,0,0,0,0,0,0]
["OcttoDec12StirlingNot available","Stirling","Not available","OcttoDec12",0.22,0.26,0.14000000000000001,0.12,0.26,1,0.43,0.28999999999999998,0.24,0.05,0,1]
["OcttoDec12StirlingTotals","Stirling","Totals","OcttoDec12",0.44,0.2,0.06,7.0000000000000007E-2,0.22,1,0.28000000000000003,0.43,0.18,0.11,0,1]
["OcttoDec12West DunbartonshireCritical","West Dunbartonshire","Critical","OcttoDec12",0.57999999999999996,0.25,0.17,0,0,1,0.74,0.26,0,0,0,1]
["OcttoDec12West DunbartonshireSubstantial","West Dunbartonshire","Substantial","OcttoDec12",0.23,0.47,0.17,7.0000000000000007E-2,7.0000000000000007E-2,1,0.84,0.11,0.03,0.03,0,1]
["OcttoDec12West DunbartonshireModerate","West Dunbartonshire","Moderate","OcttoDec12",0.16,0.34,0.33,0.12,0.05,1,0.71,0.21,0.04,0.04,0,1]
["OcttoDec12West DunbartonshireLow or No Risk","West Dunbartonshire","Low or No Risk","OcttoDec12",0,0.2,0.28000000000000003,0.22,0.3,1,0.83,0.17,0,0,0,1]
["OcttoDec12West DunbartonshireNot available","West Dunbartonshire","Not available","OcttoDec12",0,0,0,0,0,0,0,0,0,0,0,0]
["OcttoDec12West DunbartonshireTotals","West Dunbartonshire","Totals","OcttoDec12",0.16,0.32,0.27,0.13,0.13,1,0.77,0.19,0.02,0.02,0,1]
["OcttoDec12West LothianCritical","West Lothian","Critical","OcttoDec12",0.03,0.44,0.35,0.09,0.09,1,0.24,0.34,0.2,0.2,0.02,1]
["OcttoDec12West LothianSubstantial","West Lothian","Substantial","OcttoDec12",0.04,0.31,0.4,0.13,0.13,1,0.31,0.39,0.14000000000000001,0.08,0.08,1]
["OcttoDec12West LothianModerate","West Lothian","Moderate","OcttoDec12",0.18,0.27,0.27,0.18,0.09,1,0.19,0.48,0.19,0.14000000000000001,0,1]
["OcttoDec12West LothianLow or No Risk","West Lothian","Low or No Risk","OcttoDec12",0.23,0.38,0.15,0.15,0.08,1,0,0.67,0,0,0.33,1]
["OcttoDec12West LothianNot available","West Lothian","Not available","OcttoDec12",0,0.4,0.6,0,0,1,1,0,0,0,0,1]
["OcttoDec12West LothianTotals","West Lothian","Totals","OcttoDec12",0.08,0.35,0.34,0.12,0.1,1,0.25,0.39,0.17,0.14000000000000001,0.05,1]
["OcttoDec12SCOTLAND TOTALSCritical","SCOTLAND TOTALS","Critical","OcttoDec12",0.34,0.31,0.12,0.05,0.18,1,0.35,0.43,0.11,0.06,0.05,1]
["OcttoDec12SCOTLAND TOTALSSubstantial","SCOTLAND TOTALS","Substantial","OcttoDec12",0.22,0.25,0.15,0.1,0.28000000000000003,1,0.24,0.57999999999999996,0.08,0.05,0.04,1]
["OcttoDec12SCOTLAND TOTALSModerate","SCOTLAND TOTALS","Moderate","OcttoDec12",0.16,0.24,0.16,0.09,0.35,1,0.26,0.55000000000000004,7.0000000000000007E-2,0.06,0.06,1]
["OcttoDec12SCOTLAND TOTALSLow or No Risk","SCOTLAND TOTALS","Low or No Risk","OcttoDec12",0.19,0.2,0.11,0.08,0.41,1,0.15,0.72,0.03,0.04,0.06,1]
["OcttoDec12SCOTLAND TOTALSNot available","SCOTLAND TOTALS","Not available","OcttoDec12",0.17,0.32,0.2,0.11,0.21,1,0.12,0.7,0.11,0.05,0.03,1]
["OcttoDec12SCOTLAND TOTALSTotals","SCOTLAND TOTALS","Totals","OcttoDec12",0.21,0.28000000000000003,0.16,0.09,0.26,1,0.23,0.59,0.09,0.05,0.04,1]
["JantoMar13Aberdeen CityCritical","Aberdeen City","Critical","JantoMar13",0.18,0.39,0.26,0.08,0.08,1,0.09,0.45,0.18,0.18,0.09,1]
["JantoMar13Aberdeen CitySubstantial","Aberdeen City","Substantial","JantoMar13",0.13,0.34,0.2,0.13,0.21,1,0.12,0.56000000000000005,0.24,0.04,0.04,1]
["JantoMar13Aberdeen CityModerate","Aberdeen City","Moderate","JantoMar13",0.15,0.1,0.25,0.25,0.25,1,0.5,0.5,0,0,0,1]
["JantoMar13Aberdeen CityLow or No Risk","Aberdeen City","Low or No Risk","JantoMar13",0.11,0,0.11,0.11,0.67,1,0,1,0,0,0,1]
["JantoMar13Aberdeen CityNot available","Aberdeen City","Not available","JantoMar13",0,0,0.5,0.25,0.25,1,0,1,0,0,0,1]
["JantoMar13Aberdeen CityTotals","Aberdeen City","Totals","JantoMar13",0.14000000000000001,0.28999999999999998,0.23,0.13,0.21,1,0.13,0.55000000000000004,0.2,0.08,0.05,1]
["JantoMar13AberdeenshireCritical","Aberdeenshire","Critical","JantoMar13",0.2,0.2,0.4,0,0.2,1,0,0,0,0,0,0]
["JantoMar13AberdeenshireSubstantial","Aberdeenshire","Substantial","JantoMar13",0,0.44,0.11,0.11,0.33,1,0,0,0,0,0,0]
["JantoMar13AberdeenshireModerate","Aberdeenshire","Moderate","JantoMar13",0,0.47,0.28999999999999998,0,0.24,1,0,0,0,0,0,0]
["JantoMar13AberdeenshireLow or No Risk","Aberdeenshire","Low or No Risk","JantoMar13",0.05,0.4,0.25,0.1,0.2,1,0,0,0,0,0,0]
["JantoMar13AberdeenshireNot available","Aberdeenshire","Not available","JantoMar13",0.06,0.32,0.16,0.11,0.35,1,0,0,0,0,0,0]
["JantoMar13AberdeenshireTotals","Aberdeenshire","Totals","JantoMar13",0.06,0.34,0.18,0.1,0.33,1,0,0,0,0,0,0]
["JantoMar13AngusCritical","Angus","Critical","JantoMar13",0.56999999999999995,7.0000000000000007E-2,0,0,0.36,1,0.7,0.26,0,0,0.04,1]
["JantoMar13AngusSubstantial","Angus","Substantial","JantoMar13",0.74,0.03,0.1,0,0.13,1,0.36,0.56999999999999995,0.02,0,0.05,1]
["JantoMar13AngusModerate","Angus","Moderate","JantoMar13",0.65,0.06,0.12,0.06,0.12,1,0.41,0.47,0.09,0,0.03,1]
["JantoMar13AngusLow or No Risk","Angus","Low or No Risk","JantoMar13",0.68,0.15,0.03,0.12,0.03,1,0.12,0.82,0.03,0.03,0.01,1]
["JantoMar13AngusNot available","Angus","Not available","JantoMar13",0.5,0.4,0,0.1,0,1,0.4,0.3,0,0,0.3,1]
[{"$f":"D1604&B1604&C1604","v":"JantoMar13AngusTotals"},"Angus","Totals","JantoMar13",0.66,0.11,0.06,0.06,0.11,1,0.32,0.6,0.03,0.01,0.04,1]
["JantoMar13Argyll & ButeCritical","Argyll & Bute","Critical","JantoMar13",0.45,0.26,0.12,0.08,0.09,1,0.39,0.45,0.08,0.05,0.03,1]
["JantoMar13Argyll & ButeSubstantial","Argyll & Bute","Substantial","JantoMar13",0.28000000000000003,0.32,0.13,0.04,0.22,1,0.38,0.32,0.18,0.1,0.02,1]
["JantoMar13Argyll & ButeModerate","Argyll & Bute","Moderate","JantoMar13",0.23,0.06,0.15,0.02,0.54,1,1,0,0,0,0,1]
["JantoMar13Argyll & ButeLow or No Risk","Argyll & Bute","Low or No Risk","JantoMar13",0.09,0.27,0.09,0,0.55000000000000004,1,0,0,0,0,0,0]
["JantoMar13Argyll & ButeNot available","Argyll & Bute","Not available","JantoMar13",0,0,0,0,0,0,0,0,0,0,0,0]
["JantoMar13Argyll & ButeTotals","Argyll & Bute","Totals","JantoMar13",0.31,0.25,0.13,0.05,0.26,1,0.39,0.37,0.13,0.08,0.02,1]
["JantoMar13ClackmannanshireCritical","Clackmannanshire","Critical","JantoMar13",0,0,0,0,0,0,0,0,0,0,0,0]
["JantoMar13ClackmannanshireSubstantial","Clackmannanshire","Substantial","JantoMar13",0.19,0.28999999999999998,0.14000000000000001,0.14000000000000001,0.24,1,0,0,0,0,0,0]
["JantoMar13ClackmannanshireModerate","Clackmannanshire","Moderate","JantoMar13",0,0.18,0.09,0.32,0.41,1,0,0,0,0,0,0]
["JantoMar13ClackmannanshireLow or No Risk","Clackmannanshire","Low or No Risk","JantoMar13",0,0,0.04,0.16,0.8,1,0,0,0,0,0,0]
["JantoMar13ClackmannanshireNot available","Clackmannanshire","Not available","JantoMar13",0,0,0,0,0,0,0.67,0.28999999999999998,0.03,0.01,0,1]
["JantoMar13ClackmannanshireTotals","Clackmannanshire","Totals","JantoMar13",0.05,0.11,0.08,0.19,0.56999999999999995,1,0.67,0.28999999999999998,0.03,0.01,0,1]
["JantoMar13Dumfries and GallowayCritical","Dumfries and Galloway","Critical","JantoMar13",0,0,0,0,0,0,0,0,0,0,0,0]
["JantoMar13Dumfries and GallowaySubstantial","Dumfries and Galloway","Substantial","JantoMar13",0,0,0,0,0,0,0,0,0,0,0,0]
["JantoMar13Dumfries and GallowayModerate","Dumfries and Galloway","Moderate","JantoMar13",0,0,0,0,0,0,0,0,0,0,0,0]
["JantoMar13Dumfries and GallowayLow or No Risk","Dumfries and Galloway","Low or No Risk","JantoMar13",0,0,0,0,0,0,0,0,0,0,0,0]
["JantoMar13Dumfries and GallowayNot available","Dumfries and Galloway","Not available","JantoMar13",0.09,0.32,0.28999999999999998,0.13,0.17,1,0.05,0.72,0.16,0.04,0.04,1]
["JantoMar13Dumfries and GallowayTotals","Dumfries and Galloway","Totals","JantoMar13",0.09,0.32,0.28999999999999998,0.13,0.17,1,0.05,0.72,0.16,0.04,0.04,1]
["JantoMar13Dundee CityCritical","Dundee City","Critical","JantoMar13",0.31,0.4,0.2,0,0.09,1,0.03,0.7,0.21,0.06,0,1]
["JantoMar13Dundee CitySubstantial","Dundee City","Substantial","JantoMar13",0.21,0.31,0.1,0.13,0.26,1,0.19,0.61,0.11,0.08,0,1]
["JantoMar13Dundee CityModerate","Dundee City","Moderate","JantoMar13",0.11,0.33,0.13,0.1,0.32,1,0.34,0.53,0.05,0.08,0,1]
["JantoMar13Dundee CityLow or No Risk","Dundee City","Low or No Risk","JantoMar13",0.13,0.22,0.2,0.1,0.35,1,0.44,0.56000000000000005,0,0,0,1]
["JantoMar13Dundee CityNot available","Dundee City","Not available","JantoMar13",0.17,0.33,0.33,0,0.17,1,0,1,0,0,0,1]
["JantoMar13Dundee CityTotals","Dundee City","Totals","JantoMar13",0.15,0.32,0.15,0.09,0.28999999999999998,1,0.22,0.61,0.1,0.06,0,1]
["JantoMar13East AyrshireCritical","East Ayrshire","Critical","JantoMar13",0.72,0.28000000000000003,0,0,0,1,0.52,0.36,0.12,0,0,1]
["JantoMar13East AyrshireSubstantial","East Ayrshire","Substantial","JantoMar13",7.0000000000000007E-2,0.36,0.35,0.15,0.08,1,0.5,0.43,0.02,0.05,0,1]
["JantoMar13East AyrshireModerate","East Ayrshire","Moderate","JantoMar13",0.14000000000000001,0.32,0.11,0.1,0.34,1,0.49,0.26,0.1,0.09,0.06,1]
["JantoMar13East AyrshireLow or No Risk","East Ayrshire","Low or No Risk","JantoMar13",0.38,0.25,0.25,0,0.13,1,1,0,0,0,0,1]
["JantoMar13East AyrshireNot available","East Ayrshire","Not available","JantoMar13",0,0,0,0,0,0,0,0,0,0,0,0]
["JantoMar13East AyrshireTotals","East Ayrshire","Totals","JantoMar13",0.26,0.32,0.17,0.09,0.17,1,0.5,0.33,0.08,0.06,0.03,1]
["JantoMar13East DunbartonshireCritical","East Dunbartonshire","Critical","JantoMar13",0.5,0,0.25,0.25,0,1,0,0.83,0,0.17,0,1]
["JantoMar13East DunbartonshireSubstantial","East Dunbartonshire","Substantial","JantoMar13",0.73,0.12,0.09,0.04,0.02,1,0,0.93,0.05,0.02,0,1]
["JantoMar13East DunbartonshireModerate","East Dunbartonshire","Moderate","JantoMar13",0.56999999999999995,0.3,0.04,0.04,0.04,1,0,1,0,0,0,1]
["JantoMar13East DunbartonshireLow or No Risk","East Dunbartonshire","Low or No Risk","JantoMar13",0.71,0,0.14000000000000001,0,0.14000000000000001,1,0,1,0,0,0,1]
["JantoMar13East DunbartonshireNot available","East Dunbartonshire","Not available","JantoMar13",0,0.63,0.25,0,0.13,1,0,1,0,0,0,1]
["JantoMar13East DunbartonshireTotals","East Dunbartonshire","Totals","JantoMar13",0.68,0.15,0.09,0.04,0.03,1,0,0.94,0.04,0.02,0,1]
["JantoMar13East LothianCritical","East Lothian","Critical","JantoMar13",0,0,0,0,0,0,0,0,0,0,0,0]
["JantoMar13East LothianSubstantial","East Lothian","Substantial","JantoMar13",0.28999999999999998,0.22,0.18,0.12,0.19,1,0.22,0.46,0.21,0.09,0.02,1]
["JantoMar13East LothianModerate","East Lothian","Moderate","JantoMar13",0,0,0,0,0,0,0,0,0,0,0,0]
["JantoMar13East LothianLow or No Risk","East Lothian","Low or No Risk","JantoMar13",0,0,0,0,0,0,0,0,0,0,0,0]
["JantoMar13East LothianNot available","East Lothian","Not available","JantoMar13",0,0,0,0,0,0,0,0,0,0,0,0]
["JantoMar13East LothianTotals","East Lothian","Totals","JantoMar13",0.28999999999999998,0.22,0.18,0.12,0.19,1,0.22,0.46,0.21,0.09,0.02,1]
["JantoMar13East RenfrewshireCritical","East Renfrewshire","Critical","JantoMar13",0.6,0.28000000000000003,0.12,0,0,1,0.08,0.92,0,0,0,1]
["JantoMar13East RenfrewshireSubstantial","East Renfrewshire","Substantial","JantoMar13",0.26,0.63,0.12,0,0,1,0,0.88,7.0000000000000007E-2,0.05,0,1]
["JantoMar13East RenfrewshireModerate","East Renfrewshire","Moderate","JantoMar13",0.18,0.73,0.09,0,0,1,0,0.91,0.09,0,0,1]
["JantoMar13East RenfrewshireLow or No Risk","East Renfrewshire","Low or No Risk","JantoMar13",0,0.5,0.5,0,0,1,0,0.5,0.5,0,0,1]
["JantoMar13East RenfrewshireNot available","East Renfrewshire","Not available","JantoMar13",0.47,0.5,0.03,0,0,1,0,0.97,0.03,0,0,1]
["JantoMar13East RenfrewshireTotals","East Renfrewshire","Totals","JantoMar13",0.38,0.52,0.1,0,0,1,0.02,0.91,0.05,0.02,0,1]
["JantoMar13Edinburgh, City ofCritical","Edinburgh, City of","Critical","JantoMar13",0,0,0,0,0,0,0,0,0,0,0,0]
["JantoMar13Edinburgh, City ofSubstantial","Edinburgh, City of","Substantial","JantoMar13",0,0,0,0,0,0,0,0,0,0,0,0]
["JantoMar13Edinburgh, City ofModerate","Edinburgh, City of","Moderate","JantoMar13",0,0,0,0,0,0,0,0,0,0,0,0]
["JantoMar13Edinburgh, City ofLow or No Risk","Edinburgh, City of","Low or No Risk","JantoMar13",0,0,0,0,0,0,0,0,0,0,0,0]
["JantoMar13Edinburgh, City ofNot available","Edinburgh, City of","Not available","JantoMar13",0.21,0.33,0.25,0.1,0.11,1,0.02,0.71,0.15,0.09,0.03,1]
["JantoMar13Edinburgh, City ofTotals","Edinburgh, City of","Totals","JantoMar13",0.21,0.33,0.25,0.1,0.11,1,0.02,0.71,0.15,0.09,0.03,1]
["JantoMar13Eilean SiarCritical","Eilean Siar","Critical","JantoMar13",0,1,0,0,0,1,1,0,0,0,0,1]
["JantoMar13Eilean SiarSubstantial","Eilean Siar","Substantial","JantoMar13",0,0.5,0.5,0,0,1,0,0.5,0.5,0,0,1]
["JantoMar13Eilean SiarModerate","Eilean Siar","Moderate","JantoMar13",0,0,0,0,0,0,0,0,0,0,0,0]
["JantoMar13Eilean SiarLow or No Risk","Eilean Siar","Low or No Risk","JantoMar13",0,0,0,0,0,0,0,0,0,0,0,0]
["JantoMar13Eilean SiarNot available","Eilean Siar","Not available","JantoMar13",0.31,0.35,0.12,0.15,0.08,1,0.19,0.57999999999999996,0.19,0.04,0,1]
["JantoMar13Eilean SiarTotals","Eilean Siar","Totals","JantoMar13",0.28000000000000003,0.38,0.14000000000000001,0.14000000000000001,7.0000000000000007E-2,1,0.21,0.55000000000000004,0.21,0.03,0,1]
["JantoMar13FalkirkCritical","Falkirk","Critical","JantoMar13",0.57999999999999996,0.18,0.06,0.05,0.13,1,1,0,0,0,0,1]
["JantoMar13FalkirkSubstantial","Falkirk","Substantial","JantoMar13",0.23,0.23,0.06,0.09,0.39,1,0.82,0.18,0,0,0,1]
["JantoMar13FalkirkModerate","Falkirk","Moderate","JantoMar13",0.2,0.24,0.05,0.04,0.47,1,0.8,0.2,0,0,0,1]
[{"$f":"D1668&B1668&C1668","v":"JantoMar13FalkirkLow or No Risk"},"Falkirk","Low or No Risk","JantoMar13",0.13,7.0000000000000007E-2,0,7.0000000000000007E-2,0.73,1,1,0,0,0,0,1]
["JantoMar13FalkirkNot available","Falkirk","Not available","JantoMar13",0,0,0,0,0,0,1,0,0,0,0,1]
["JantoMar13FalkirkTotals","Falkirk","Totals","JantoMar13",0.31,0.21,0.06,7.0000000000000007E-2,0.37,1,0.96,0.04,0,0,0,1]
["JantoMar13FifeCritical","Fife","Critical","JantoMar13",0.11,0.69,0.11,0.04,0.05,1,0,0.6,0.27,7.0000000000000007E-2,7.0000000000000007E-2,1]
["JantoMar13FifeSubstantial","Fife","Substantial","JantoMar13",0.06,0.24,0.26,0.16,0.28000000000000003,1,0.06,0.51,0.2,0.12,0.11,1]
["JantoMar13FifeModerate","Fife","Moderate","JantoMar13",0.03,0.12,0.16,0.14000000000000001,0.55000000000000004,1,0.05,0.45,0.36,0.09,0.05,1]
["JantoMar13FifeLow or No Risk","Fife","Low or No Risk","JantoMar13",0,0.04,0.04,0,0.92,1,0,0,0,1,0,1]
["JantoMar13FifeNot available","Fife","Not available","JantoMar13",0.11,0.17,0.24,0.14000000000000001,0.34,1,0.05,0.47,0.19,0.19,0.12,1]
["JantoMar13FifeTotals","Fife","Totals","JantoMar13",0.06,0.25,0.21,0.13,0.35,1,0.05,0.51,0.22,0.12,0.1,1]
["JantoMar13Glasgow CityCritical","Glasgow City","Critical","JantoMar13",0.02,0.16,0.15,0.06,0.62,1,0,1,0,0,0,1]
["JantoMar13Glasgow CitySubstantial","Glasgow City","Substantial","JantoMar13",0.06,0.1,0.12,0.08,0.64,1,0,1,0,0,0,1]
["JantoMar13Glasgow CityModerate","Glasgow City","Moderate","JantoMar13",0.1,0.24,0.05,0.05,0.56999999999999995,1,0,1,0,0,0,1]
["JantoMar13Glasgow CityLow or No Risk","Glasgow City","Low or No Risk","JantoMar13",0.14000000000000001,0.27,0.09,0.05,0.45,1,0,1,0,0,0,1]
["JantoMar13Glasgow CityNot available","Glasgow City","Not available","JantoMar13",0.14000000000000001,0.48,7.0000000000000007E-2,0.09,0.22,1,0,1,0,0,0,1]
["JantoMar13Glasgow CityTotals","Glasgow City","Totals","JantoMar13",0.09,0.25,0.09,7.0000000000000007E-2,0.5,1,0,1,0,0,0,1]
["JantoMar13HighlandCritical","Highland","Critical","JantoMar13",0.15,0.36,0.18,0.09,0.21,1,0,0,0,0,0,0]
["JantoMar13HighlandSubstantial","Highland","Substantial","JantoMar13",0.19,0.22,0.11,0.19,0.28000000000000003,1,0,0,0,0,0,0]
["JantoMar13HighlandModerate","Highland","Moderate","JantoMar13",0.09,0.1,0.17,0.19,0.45,1,0,0,0,0,0,0]
["JantoMar13HighlandLow or No Risk","Highland","Low or No Risk","JantoMar13",0.09,0.09,0.18,0.09,0.55000000000000004,1,0,0,0,0,0,0]
["JantoMar13HighlandNot available","Highland","Not available","JantoMar13",0.11,0.39,0.05,0.09,0.36,1,0,0,0,0,0,0]
["JantoMar13HighlandTotals","Highland","Totals","JantoMar13",0.13,0.26,0.13,0.13,0.34,1,0,0,0,0,0,0]
["JantoMar13InverclydeCritical","Inverclyde","Critical","JantoMar13",0.24,0.12,0.12,0.24,0.28999999999999998,1,0.06,0.66,0.28000000000000003,0,0,1]
["JantoMar13InverclydeSubstantial","Inverclyde","Substantial","JantoMar13",0.23,0.59,0.05,0.09,0.05,1,0.17,0.02,0.8,0,0,1]
["JantoMar13InverclydeModerate","Inverclyde","Moderate","JantoMar13",0.2,0.25,0.15,0.25,0.15,1,0.32,0.23,0.45,0,0,1]
["JantoMar13InverclydeLow or No Risk","Inverclyde","Low or No Risk","JantoMar13",0.11,0,0.33,0.11,0.44,1,1,0,0,0,0,1]
["JantoMar13InverclydeNot available","Inverclyde","Not available","JantoMar13",0.55000000000000004,0,0.09,0.36,0,1,0,0,1,0,0,1]
["JantoMar13InverclydeTotals","Inverclyde","Totals","JantoMar13",0.25,0.25,0.13,0.2,0.16,1,0.19,0.26,0.55000000000000004,0,0,1]
["JantoMar13MidlothianCritical","Midlothian","Critical","JantoMar13",0,0,0,0,0,0,0,0,0,0,0,0]
["JantoMar13MidlothianSubstantial","Midlothian","Substantial","JantoMar13",0,0,0,0,0,0,0,0,0,0,0,0]
["JantoMar13MidlothianModerate","Midlothian","Moderate","JantoMar13",0,0,0,0,0,0,0,0,0,0,0,0]
["JantoMar13MidlothianLow or No Risk","Midlothian","Low or No Risk","JantoMar13",0,0,0,0,0,0,0,0,0,0,0,0]
["JantoMar13MidlothianNot available","Midlothian","Not available","JantoMar13",0,0.19,0.25,0.18,0.38,1,0,0,0,0,0,0]
["JantoMar13MidlothianTotals","Midlothian","Totals","JantoMar13",0,0.19,0.25,0.18,0.38,1,0,0,0,0,0,0]
["JantoMar13MorayCritical","Moray","Critical","JantoMar13",0.33,0.67,0,0,0,1,0.08,0.57999999999999996,0.33,0,0,1]
["JantoMar13MoraySubstantial","Moray","Substantial","JantoMar13",0.28000000000000003,0.55000000000000004,0.11,0.06,0,1,0.21,0.72,0.05,0.02,0,1]
["JantoMar13MorayModerate","Moray","Moderate","JantoMar13",0.13,0.53,0.19,0.09,0.06,1,0.09,0.82,0.09,0,0,1]
["JantoMar13MorayLow or No Risk","Moray","Low or No Risk","JantoMar13",0,1,0,0,0,1,0,1,0,0,0,1]
["JantoMar13MorayNot available","Moray","Not available","JantoMar13",0,0,0,0,0,0,0,0,0,0,0,0]
["JantoMar13MorayTotals","Moray","Totals","JantoMar13",0.21,0.56000000000000005,0.13,7.0000000000000007E-2,0.02,1,0.17,0.72,0.1,0.01,0,1]
["JantoMar13North AyrshireCritical","North Ayrshire","Critical","JantoMar13",0.14000000000000001,0.43,0.28999999999999998,0,0.14000000000000001,1,0.35,0.41,0.06,0.12,0.06,1]
["JantoMar13North AyrshireSubstantial","North Ayrshire","Substantial","JantoMar13",0,0.31,0.23,0.23,0.23,1,0.71,0.17,0.06,0.03,0.03,1]
["JantoMar13North AyrshireModerate","North Ayrshire","Moderate","JantoMar13",0,0,0.71,0.14000000000000001,0.14000000000000001,1,0.5,0.5,0,0,0,1]
["JantoMar13North AyrshireLow or No Risk","North Ayrshire","Low or No Risk","JantoMar13",0,0.44,0.11,0,0.44,1,0.67,0.33,0,0,0,1]
["JantoMar13North AyrshireNot available","North Ayrshire","Not available","JantoMar13",1,0,0,0,0,1,0,0,0,0,0,0]
["JantoMar13North AyrshireTotals","North Ayrshire","Totals","JantoMar13",0.08,0.28999999999999998,0.28999999999999998,0.11,0.24,1,0.6,0.26,0.05,0.05,0.04,1]
["JantoMar13North LanarkshireCritical","North Lanarkshire","Critical","JantoMar13",0.72,0.18,0.04,0.01,0.05,1,0.23,0.7,0.03,0.02,0.03,1]
["JantoMar13North LanarkshireSubstantial","North Lanarkshire","Substantial","JantoMar13",0.56000000000000005,0.23,0.08,0.04,0.09,1,0.4,0.54,0.04,0,0.01,1]
["JantoMar13North LanarkshireModerate","North Lanarkshire","Moderate","JantoMar13",0.57999999999999996,0.19,0.04,0.05,0.14000000000000001,1,0.39,0.52,0.05,0,0.05,1]
["JantoMar13North LanarkshireLow or No Risk","North Lanarkshire","Low or No Risk","JantoMar13",0.56999999999999995,0.23,0.06,7.0000000000000007E-2,7.0000000000000007E-2,1,0.3,0.61,0,0,0.09,1]
["JantoMar13North LanarkshireNot available","North Lanarkshire","Not available","JantoMar13",0,0,0,0,0,0,0,0,0,0,0,0]
["JantoMar13North LanarkshireTotals","North Lanarkshire","Totals","JantoMar13",0.64,0.2,0.05,0.03,0.08,1,0.3,0.63,0.03,0.01,0.03,1]
["JantoMar13Orkney islandsCritical","Orkney islands","Critical","JantoMar13",0,0,0,0,0,0,0,0,0,0,0,0]
["JantoMar13Orkney islandsSubstantial","Orkney islands","Substantial","JantoMar13",0,0,0,0,0,0,0,0,0,0,0,0]
["JantoMar13Orkney islandsModerate","Orkney islands","Moderate","JantoMar13",0,0,0,0,0,0,0,0,0,0,0,0]
["JantoMar13Orkney islandsLow or No Risk","Orkney islands","Low or No Risk","JantoMar13",0,0,0,0,0,0,0,0,0,0,0,0]
["JantoMar13Orkney islandsNot available","Orkney islands","Not available","JantoMar13",0,0,0,0,0,0,0,0,0,0,0,0]
["JantoMar13Orkney islandsTotals","Orkney islands","Totals","JantoMar13",0,0,0,0,0,0,0,0,0,0,0,0]
["JantoMar13Perth & KinrossCritical","Perth & Kinross","Critical","JantoMar13",0.67,0.33,0,0,0,1,0,1,0,0,0,1]
["JantoMar13Perth & KinrossSubstantial","Perth & Kinross","Substantial","JantoMar13",0.28999999999999998,0.23,0.21,0.09,0.18,1,0,0.71,0,0.18,0.12,1]
["JantoMar13Perth & KinrossModerate","Perth & Kinross","Moderate","JantoMar13",0.28000000000000003,0.2,0.11,0.15,0.27,1,0,0.68,0.05,0,0.26,1]
["JantoMar13Perth & KinrossLow or No Risk","Perth & Kinross","Low or No Risk","JantoMar13",0.46,0.15,0,0.15,0.23,1,0,1,0,0,0,1]
["JantoMar13Perth & KinrossNot available","Perth & Kinross","Not available","JantoMar13",0.25,0.33,0.18,7.0000000000000007E-2,0.16,1,0,0,0,0,0,0]
["JantoMar13Perth & KinrossTotals","Perth & Kinross","Totals","JantoMar13",0.28999999999999998,0.24,0.15,0.11,0.21,1,0,0.73,0.02,7.0000000000000007E-2,0.17,1]
["JantoMar13RenfrewshireCritical","Renfrewshire","Critical","JantoMar13",0.84,0.05,0.11,0,0,1,0.25,0.56000000000000005,0.19,0,0,1]
[{"$f":"D1732&B1732&C1732","v":"JantoMar13RenfrewshireSubstantial"},"Renfrewshire","Substantial","JantoMar13",0.69,0.14000000000000001,0.11,0.06,0,1,0.18,0.55000000000000004,0.18,0.06,0.03,1]
["JantoMar13RenfrewshireModerate","Renfrewshire","Moderate","JantoMar13",0.28999999999999998,0.14000000000000001,0.14000000000000001,0.28999999999999998,0.14000000000000001,1,0.5,0.5,0,0,0,1]
["JantoMar13RenfrewshireLow or No Risk","Renfrewshire","Low or No Risk","JantoMar13",0.5,0,0,0,0.5,1,0,0,0,0,0,0]
["JantoMar13RenfrewshireNot available","Renfrewshire","Not available","JantoMar13",0.19,0.12,0.18,0.06,0.45,1,0.51,0.33,0.04,7.0000000000000007E-2,0.05,1]
["JantoMar13RenfrewshireTotals","Renfrewshire","Totals","JantoMar13",0.37,0.12,0.15,0.06,0.3,1,0.34,0.46,0.12,0.04,0.03,1]
["JantoMar13Scottish BordersCritical","Scottish Borders","Critical","JantoMar13",0.2,0.28000000000000003,0.19,0.09,0.25,1,0.13,0.61,0.17,0.05,0.03,1]
["JantoMar13Scottish BordersSubstantial","Scottish Borders","Substantial","JantoMar13",0.11,0.16,0.19,0.1,0.44,1,0,0.6,0.2,0.2,0,1]
["JantoMar13Scottish BordersModerate","Scottish Borders","Moderate","JantoMar13",0,0,0,0,1,1,0,0,0,0,0,0]
["JantoMar13Scottish BordersLow or No Risk","Scottish Borders","Low or No Risk","JantoMar13",0,0,0.33,0,0.67,1,0,0,0,0,0,0]
["JantoMar13Scottish BordersNot available","Scottish Borders","Not available","JantoMar13",0,0,0,0,0,0,0,0,0,0,0,0]
["JantoMar13Scottish BordersTotals","Scottish Borders","Totals","JantoMar13",0.17,0.25,0.19,0.09,0.3,1,0.13,0.61,0.18,0.06,0.03,1]
["JantoMar13Shetland islandsCritical","Shetland islands","Critical","JantoMar13",0.14000000000000001,0.56999999999999995,0.28999999999999998,0,0,1,0,1,0,0,0,1]
["JantoMar13Shetland islandsSubstantial","Shetland islands","Substantial","JantoMar13",0.33,0.67,0,0,0,1,0.22,0.78,0,0,0,1]
["JantoMar13Shetland islandsModerate","Shetland islands","Moderate","JantoMar13",0,0.71,0.28999999999999998,0,0,1,0.25,0.75,0,0,0,1]
["JantoMar13Shetland islandsLow or No Risk","Shetland islands","Low or No Risk","JantoMar13",0,0,0,1,0,1,0,0,0,0,0,0]
["JantoMar13Shetland islandsNot available","Shetland islands","Not available","JantoMar13",0.06,0.33,0.25,0.17,0.19,1,0,1,0,0,0,1]
["JantoMar13Shetland islandsTotals","Shetland islands","Totals","JantoMar13",0.09,0.44,0.23,0.12,0.12,1,0.14000000000000001,0.86,0,0,0,1]
["JantoMar13South AyrshireCritical","South Ayrshire","Critical","JantoMar13",0.36,0.41,0.23,0,0,1,0.63,0.25,0.13,0,0,1]
["JantoMar13South AyrshireSubstantial","South Ayrshire","Substantial","JantoMar13",0.82,0.09,0.09,0,0,1,0.19,0.63,0.19,0,0,1]
["JantoMar13South AyrshireModerate","South Ayrshire","Moderate","JantoMar13",0.21,0.37,0.28999999999999998,0.05,0.08,1,0.52,0.35,0.13,0,0,1]
["JantoMar13South AyrshireLow or No Risk","South Ayrshire","Low or No Risk","JantoMar13",0.41,0.27,0.2,0.03,0.08,1,0.63,0.22,0.15,0,0,1]
["JantoMar13South AyrshireNot available","South Ayrshire","Not available","JantoMar13",0,0,0,0,0,0,0,0,0,0,0,0]
["JantoMar13South AyrshireTotals","South Ayrshire","Totals","JantoMar13",0.37,0.32,0.22,0.03,0.05,1,0.54,0.32,0.14000000000000001,0,0,1]
["JantoMar13South LanarkshireCritical","South Lanarkshire","Critical","JantoMar13",0,0,0,0,0,0,0,0,0,0,0,0]
["JantoMar13South LanarkshireSubstantial","South Lanarkshire","Substantial","JantoMar13",0,0,0,0,0,0,0,0,0,0,0,0]
["JantoMar13South LanarkshireModerate","South Lanarkshire","Moderate","JantoMar13",0,0,0,0,0,0,0,0,0,0,0,0]
["JantoMar13South LanarkshireLow or No Risk","South Lanarkshire","Low or No Risk","JantoMar13",0,0,0,0,0,0,0,0,0,0,0,0]
["JantoMar13South LanarkshireNot available","South Lanarkshire","Not available","JantoMar13",0,0,0,0,0,0,0,0,0,0,0,0]
["JantoMar13South LanarkshireTotals","South Lanarkshire","Totals","JantoMar13",0,0,0,0,0,0,0,0,0,0,0,0]
["JantoMar13StirlingCritical","Stirling","Critical","JantoMar13",0.67,0.2,7.0000000000000007E-2,0.02,0.04,1,0.06,0.55000000000000004,0.32,0.06,0,1]
["JantoMar13StirlingSubstantial","Stirling","Substantial","JantoMar13",0.37,0.1,0,0.08,0.45,1,0.25,0.42,0.17,0.17,0,1]
["JantoMar13StirlingModerate","Stirling","Moderate","JantoMar13",0.25,0.08,0,0,0.67,1,0,0,1,0,0,1]
["JantoMar13StirlingLow or No Risk","Stirling","Low or No Risk","JantoMar13",0,0,0,0,0,0,0,0,0,0,0,0]
["JantoMar13StirlingNot available","Stirling","Not available","JantoMar13",0.18,0.11,0.2,0.09,0.42,1,0.08,0.57999999999999996,0.21,0.08,0.04,1]
["JantoMar13StirlingTotals","Stirling","Totals","JantoMar13",0.38,0.13,0.09,0.06,0.34,1,0.1,0.52,0.28000000000000003,0.09,0.01,1]
["JantoMar13West DunbartonshireCritical","West Dunbartonshire","Critical","JantoMar13",0.45,0.09,0.18,0.27,0,1,0.82,0.16,0,0.02,0,1]
["JantoMar13West DunbartonshireSubstantial","West Dunbartonshire","Substantial","JantoMar13",0.27,0.41,0.02,0.16,0.14000000000000001,1,0.85,0.12,0.02,0,0,1]
["JantoMar13West DunbartonshireModerate","West Dunbartonshire","Moderate","JantoMar13",0.33,0,0.14000000000000001,0.12,0.4,1,0.77,0.19,0,0,0.03,1]
["JantoMar13West DunbartonshireLow or No Risk","West Dunbartonshire","Low or No Risk","JantoMar13",0.24,0.1,0.06,0.1,0.5,1,0.73,0.27,0,0,0,1]
["JantoMar13West DunbartonshireNot available","West Dunbartonshire","Not available","JantoMar13",0,0,0,0,0,0,0,0,0,0,0,0]
["JantoMar13West DunbartonshireTotals","West Dunbartonshire","Totals","JantoMar13",0.3,0.15,0.09,0.14000000000000001,0.33,1,0.81,0.16,0.01,0.01,0.01,1]
["JantoMar13West LothianCritical","West Lothian","Critical","JantoMar13",0.3,0.33,0.19,0.04,0.15,1,0.38,0.35,0.19,0.08,0,1]
["JantoMar13West LothianSubstantial","West Lothian","Substantial","JantoMar13",0.2,0.2,0.23,0.14000000000000001,0.23,1,0.44,0.28000000000000003,0.22,0,0.06,1]
["JantoMar13West LothianModerate","West Lothian","Moderate","JantoMar13",0.18,0.18,0.3,0.15,0.18,1,0.28000000000000003,0.5,0.22,0,0,1]
["JantoMar13West LothianLow or No Risk","West Lothian","Low or No Risk","JantoMar13",0.09,0.27,0.09,0,0.55000000000000004,1,1,0,0,0,0,1]
["JantoMar13West LothianNot available","West Lothian","Not available","JantoMar13",0.33,0.33,0,0.33,0,1,0,0,0,0,0,0]
["JantoMar13West LothianTotals","West Lothian","Totals","JantoMar13",0.21,0.24,0.22,0.11,0.22,1,0.38,0.37,0.21,0.03,0.02,1]
["JantoMar13SCOTLAND TOTALSCritical","SCOTLAND TOTALS","Critical","JantoMar13",0.4,0.28000000000000003,0.12,0.05,0.15,1,0.42,0.45,0.09,0.03,0.01,1]
["JantoMar13SCOTLAND TOTALSSubstantial","SCOTLAND TOTALS","Substantial","JantoMar13",0.25,0.23,0.15,0.1,0.27,1,0.2,0.61,0.12,0.05,0.03,1]
["JantoMar13SCOTLAND TOTALSModerate","SCOTLAND TOTALS","Moderate","JantoMar13",0.19,0.23,0.12,0.09,0.37,1,0.28000000000000003,0.57999999999999996,0.09,0.02,0.03,1]
["JantoMar13SCOTLAND TOTALSLow or No Risk","SCOTLAND TOTALS","Low or No Risk","JantoMar13",0.27,0.18,0.11,0.08,0.36,1,0.28000000000000003,0.65,0.04,0.02,0.02,1]
["JantoMar13SCOTLAND TOTALSNot available","SCOTLAND TOTALS","Not available","JantoMar13",0.17,0.33,0.21,0.1,0.19,1,0.11,0.71,0.1,0.05,0.02,1]
["JantoMar13SCOTLAND TOTALSTotals","SCOTLAND TOTALS","Totals","JantoMar13",0.24,0.26,0.16,0.09,0.25,1,0.24,0.6,0.1,0.04,0.02,1]
["AprtoJun13Aberdeen CityCritical","Aberdeen City","Critical","AprtoJun13",0.27,0.39,0.06,0.12,0.15,1,0,0.31,0.31,0.15,0.23,1]
["AprtoJun13Aberdeen CitySubstantial","Aberdeen City","Substantial","AprtoJun13",0.21,0.38,0.22,0.1,0.09,1,0.05,0.27,0.36,0.18,0.14000000000000001,1]
["AprtoJun13Aberdeen CityModerate","Aberdeen City","Moderate","AprtoJun13",0.2,0.4,0.2,0.2,0,1,0,0,0,0,1,1]
["AprtoJun13Aberdeen CityLow or No Risk","Aberdeen City","Low or No Risk","AprtoJun13",0,0,0,0,0,0,0,0,0,0,0,0]
["AprtoJun13Aberdeen CityNot available","Aberdeen City","Not available","AprtoJun13",0.44,0.33,0.11,0,0.11,1,0,0,0.5,0.5,0,1]
["AprtoJun13Aberdeen CityTotals","Aberdeen City","Totals","AprtoJun13",0.25,0.38,0.16,0.1,0.1,1,0.03,0.26,0.34,0.18,0.18,1]
["AprtoJun13AberdeenshireCritical","Aberdeenshire","Critical","AprtoJun13",0,0.67,0.33,0,0,1,0,0,0,0,0,0]
["AprtoJun13AberdeenshireSubstantial","Aberdeenshire","Substantial","AprtoJun13",0.06,0.56000000000000005,0.19,0.06,0.13,1,0,0,0,0,0,0]
["AprtoJun13AberdeenshireModerate","Aberdeenshire","Moderate","AprtoJun13",0.09,0.45,0,0.27,0.18,1,0,0,0,0,0,0]
["AprtoJun13AberdeenshireLow or No Risk","Aberdeenshire","Low or No Risk","AprtoJun13",0,0.44,0.19,0.19,0.19,1,0,0,0,0,0,0]
["AprtoJun13AberdeenshireNot available","Aberdeenshire","Not available","AprtoJun13",0.04,0.33,0.19,0.08,0.36,1,0,0,0,0,0,0]
[{"$f":"D1796&B1796&C1796","v":"AprtoJun13AberdeenshireTotals"},"Aberdeenshire","Totals","AprtoJun13",0.04,0.36,0.18,0.09,0.33,1,0,0,0,0,0,0]
["AprtoJun13AngusCritical","Angus","Critical","AprtoJun13",0.1,0.17,0.33,0.17,0.23,1,0.74,0.19,0.01,0.04,0.01,1]
["AprtoJun13AngusSubstantial","Angus","Substantial","AprtoJun13",0.4,0.03,0.09,0.09,0.4,1,0.57999999999999996,0.36,0.02,0.02,0.03,1]
["AprtoJun13AngusModerate","Angus","Moderate","AprtoJun13",0.6,0.05,0.02,0.05,0.28999999999999998,1,0.4,0.53,0.04,0.02,0,1]
["AprtoJun13AngusLow or No Risk","Angus","Low or No Risk","AprtoJun13",0.67,0.09,0.04,0.04,0.16,1,0.13,0.81,0.03,0.03,0,1]
["AprtoJun13AngusNot available","Angus","Not available","AprtoJun13",1,0,0,0,0,1,0.78,0.22,0,0,0,1]
["AprtoJun13AngusTotals","Angus","Totals","AprtoJun13",0.48,0.08,0.1,0.08,0.26,1,0.5,0.44,0.02,0.02,0.01,1]
["AprtoJun13Argyll & ButeCritical","Argyll & Bute","Critical","AprtoJun13",0.31,0.36,0.13,0.11,0.1,1,0.31,0.09,0.11,7.0000000000000007E-2,0.42,1]
["AprtoJun13Argyll & ButeSubstantial","Argyll & Bute","Substantial","AprtoJun13",0.14000000000000001,0.28000000000000003,0.2,7.0000000000000007E-2,0.31,1,0.33,0.17,0.08,0.04,0.38,1]
["AprtoJun13Argyll & ButeModerate","Argyll & Bute","Moderate","AprtoJun13",0.26,0.26,0.13,0.04,0.3,1,0,0.14000000000000001,0.14000000000000001,0,0.71,1]
["AprtoJun13Argyll & ButeLow or No Risk","Argyll & Bute","Low or No Risk","AprtoJun13",0,0,0.2,0.2,0.6,1,0,0,0,1,0,1]
["AprtoJun13Argyll & ButeNot available","Argyll & Bute","Not available","AprtoJun13",0,0,0,0,0,0,0,0,0,0,0,0]
["AprtoJun13Argyll & ButeTotals","Argyll & Bute","Totals","AprtoJun13",0.21,0.3,0.17,0.08,0.23,1,0.3,0.14000000000000001,0.1,0.06,0.41,1]
["AprtoJun13ClackmannanshireCritical","Clackmannanshire","Critical","AprtoJun13",0,0,0,0,0,0,0,0,0,0,0,0]
["AprtoJun13ClackmannanshireSubstantial","Clackmannanshire","Substantial","AprtoJun13",0.17,0.28000000000000003,0.11,0.06,0.39,1,0,0,0,0,0,0]
["AprtoJun13ClackmannanshireModerate","Clackmannanshire","Moderate","AprtoJun13",0,0.19,0,0.32,0.48,1,0,0,0,0,0,0]
["AprtoJun13ClackmannanshireLow or No Risk","Clackmannanshire","Low or No Risk","AprtoJun13",0,0.02,0,0.02,0.95,1,0,0,0,0,0,0]
["AprtoJun13ClackmannanshireNot available","Clackmannanshire","Not available","AprtoJun13",0,0,0,0,0,0,0.77,0.18,0.03,0.03,0,1]
["AprtoJun13ClackmannanshireTotals","Clackmannanshire","Totals","AprtoJun13",0.03,0.13,0.02,0.13,0.68,1,0.77,0.18,0.03,0.03,0,1]
["AprtoJun13Dumfries and GallowayCritical","Dumfries and Galloway","Critical","AprtoJun13",0,0,0,0,0,0,0,0,0,0,0,0]
["AprtoJun13Dumfries and GallowaySubstantial","Dumfries and Galloway","Substantial","AprtoJun13",0,0,0,0,0,0,0,0,0,0,0,0]
["AprtoJun13Dumfries and GallowayModerate","Dumfries and Galloway","Moderate","AprtoJun13",0,0,0,0,0,0,0,0,0,0,0,0]
["AprtoJun13Dumfries and GallowayLow or No Risk","Dumfries and Galloway","Low or No Risk","AprtoJun13",0,0,0,0,0,0,0,0,0,0,0,0]
["AprtoJun13Dumfries and GallowayNot available","Dumfries and Galloway","Not available","AprtoJun13",0.42,0.33,0.16,0.06,0.03,1,0.03,0.63,0.2,7.0000000000000007E-2,7.0000000000000007E-2,1]
["AprtoJun13Dumfries and GallowayTotals","Dumfries and Galloway","Totals","AprtoJun13",0.42,0.33,0.16,0.06,0.03,1,0.03,0.63,0.2,7.0000000000000007E-2,7.0000000000000007E-2,1]
["AprtoJun13Dundee CityCritical","Dundee City","Critical","AprtoJun13",0.3,0.4,0.1,0.1,0.1,1,0.42,0.42,0,0,0.17,1]
["AprtoJun13Dundee CitySubstantial","Dundee City","Substantial","AprtoJun13",0.24,0.44,0.13,0.04,0.13,1,0.53,0.4,0,0,7.0000000000000007E-2,1]
["AprtoJun13Dundee CityModerate","Dundee City","Moderate","AprtoJun13",0.1,0.41,0.17,0.14000000000000001,0.18,1,0.77,0.15,0,0.04,0.04,1]
["AprtoJun13Dundee CityLow or No Risk","Dundee City","Low or No Risk","AprtoJun13",0.14000000000000001,0.32,0.09,0.18,0.27,1,0.92,0,0,0.08,0,1]
["AprtoJun13Dundee CityNot available","Dundee City","Not available","AprtoJun13",0,0.5,0.5,0,0,1,1,0,0,0,0,1]
["AprtoJun13Dundee CityTotals","Dundee City","Totals","AprtoJun13",0.14000000000000001,0.41,0.16,0.12,0.17,1,0.71,0.21,0,0.03,0.06,1]
["AprtoJun13East AyrshireCritical","East Ayrshire","Critical","AprtoJun13",0.78,0.14000000000000001,0.08,0,0,1,0.88,0.09,0.03,0,0,1]
["AprtoJun13East AyrshireSubstantial","East Ayrshire","Substantial","AprtoJun13",0.24,0.26,0.27,0.08,0.15,1,0.49,0.31,0.13,0.04,0.04,1]
["AprtoJun13East AyrshireModerate","East Ayrshire","Moderate","AprtoJun13",0.23,0.13,0.21,0.09,0.33,1,0.56999999999999995,0.27,0.08,0.05,0.03,1]
["AprtoJun13East AyrshireLow or No Risk","East Ayrshire","Low or No Risk","AprtoJun13",0.75,0.17,0,0,0.08,1,0.78,0.22,0,0,0,1]
["AprtoJun13East AyrshireNot available","East Ayrshire","Not available","AprtoJun13",0,0,0,0,0,0,0,0,0,0,0,0]
["AprtoJun13East AyrshireTotals","East Ayrshire","Totals","AprtoJun13",0.36,0.17,0.2,7.0000000000000007E-2,0.2,1,0.62,0.24,0.08,0.03,0.03,1]
["AprtoJun13East DunbartonshireCritical","East Dunbartonshire","Critical","AprtoJun13",7.0000000000000007E-2,0.56999999999999995,0.28999999999999998,7.0000000000000007E-2,0,1,0,0.8,0.2,0,0,1]
["AprtoJun13East DunbartonshireSubstantial","East Dunbartonshire","Substantial","AprtoJun13",0.65,0.23,0.08,0.04,0,1,0,0.97,0.02,0.01,0,1]
["AprtoJun13East DunbartonshireModerate","East Dunbartonshire","Moderate","AprtoJun13",0.5,0.33,0.13,0.04,0,1,0,0.92,0,0.08,0,1]
["AprtoJun13East DunbartonshireLow or No Risk","East Dunbartonshire","Low or No Risk","AprtoJun13",0,0.67,0.33,0,0,1,0,0.8,0,0.2,0,1]
["AprtoJun13East DunbartonshireNot available","East Dunbartonshire","Not available","AprtoJun13",0.69,0.15,0.08,0.08,0,1,0,1,0,0,0,1]
["AprtoJun13East DunbartonshireTotals","East Dunbartonshire","Totals","AprtoJun13",0.59,0.26,0.1,0.04,0,1,0,0.96,0.02,0.01,0,1]
["AprtoJun13East LothianCritical","East Lothian","Critical","AprtoJun13",0,0,0,0,0,0,0,0.5,0.5,0,0,1]
["AprtoJun13East LothianSubstantial","East Lothian","Substantial","AprtoJun13",0.27,0.18,0.15,0.14000000000000001,0.26,1,0.2,0.4,0.27,0.11,0.03,1]
["AprtoJun13East LothianModerate","East Lothian","Moderate","AprtoJun13",0,0,0,0,0,0,0,0,0,0,0,0]
["AprtoJun13East LothianLow or No Risk","East Lothian","Low or No Risk","AprtoJun13",0,0,0,0,0,0,0,0,0,0,0,0]
["AprtoJun13East LothianNot available","East Lothian","Not available","AprtoJun13",0,0,0,0,0,0,0,0,0,0,0,0]
["AprtoJun13East LothianTotals","East Lothian","Totals","AprtoJun13",0.27,0.18,0.15,0.14000000000000001,0.26,1,0.19,0.4,0.28000000000000003,0.11,0.03,1]
["AprtoJun13East RenfrewshireCritical","East Renfrewshire","Critical","AprtoJun13",0.32,0.46,0.22,0,0,1,0.08,0.76,0.05,0.11,0,1]
["AprtoJun13East RenfrewshireSubstantial","East Renfrewshire","Substantial","AprtoJun13",0.4,0.49,7.0000000000000007E-2,0.04,0,1,0.09,0.82,0.09,0,0,1]
["AprtoJun13East RenfrewshireModerate","East Renfrewshire","Moderate","AprtoJun13",0.33,0.46,0.17,0,0.04,1,0.08,0.88,0.04,0,0,1]
["AprtoJun13East RenfrewshireLow or No Risk","East Renfrewshire","Low or No Risk","AprtoJun13",0,0,0,0,0,0,0,0,0,0,0,0]
["AprtoJun13East RenfrewshireNot available","East Renfrewshire","Not available","AprtoJun13",0.45,0.34,0.21,0,0,1,0.03,0.89,0.05,0.03,0,1]
["AprtoJun13East RenfrewshireTotals","East Renfrewshire","Totals","AprtoJun13",0.38,0.44,0.16,0.01,0.01,1,7.0000000000000007E-2,0.83,0.06,0.03,0,1]
["AprtoJun13Edinburgh, City ofCritical","Edinburgh, City of","Critical","AprtoJun13",0,0,0,0,0,0,0,0,0,0,0,0]
["AprtoJun13Edinburgh, City ofSubstantial","Edinburgh, City of","Substantial","AprtoJun13",0,0,0,0,0,0,0,0,0,0,0,0]
["AprtoJun13Edinburgh, City ofModerate","Edinburgh, City of","Moderate","AprtoJun13",0,0,0,0,0,0,0,0,0,0,0,0]
["AprtoJun13Edinburgh, City ofLow or No Risk","Edinburgh, City of","Low or No Risk","AprtoJun13",0,0,0,0,0,0,0,0,0,0,0,0]
["AprtoJun13Edinburgh, City ofNot available","Edinburgh, City of","Not available","AprtoJun13",0.23,0.27,0.28999999999999998,0.12,0.1,1,0.08,0.73,0.12,0.05,0.02,1]
["AprtoJun13Edinburgh, City ofTotals","Edinburgh, City of","Totals","AprtoJun13",0.23,0.27,0.28999999999999998,0.12,0.1,1,0.08,0.73,0.12,0.05,0.02,1]
["AprtoJun13Eilean SiarCritical","Eilean Siar","Critical","AprtoJun13",0,0,0,0,0,0,0,0,0,0,0,0]
["AprtoJun13Eilean SiarSubstantial","Eilean Siar","Substantial","AprtoJun13",0,0.6,0,7.0000000000000007E-2,0.33,1,0.09,0.36,0.18,0.27,0.09,1]
["AprtoJun13Eilean SiarModerate","Eilean Siar","Moderate","AprtoJun13",0,0,0,0,0,0,0,0,0,0,0,0]
["AprtoJun13Eilean SiarLow or No Risk","Eilean Siar","Low or No Risk","AprtoJun13",0,0,0,0,0,0,0,0,0,0,0,0]
["AprtoJun13Eilean SiarNot available","Eilean Siar","Not available","AprtoJun13",0,0.47,0.28999999999999998,0.12,0.12,1,0.15,0.46,0.31,0.08,0,1]
["AprtoJun13Eilean SiarTotals","Eilean Siar","Totals","AprtoJun13",0,0.53,0.16,0.09,0.22,1,0.13,0.42,0.25,0.17,0.04,1]
["AprtoJun13FalkirkCritical","Falkirk","Critical","AprtoJun13",0,0,0,0,0,0,0,0,0,0,0,0]
["AprtoJun13FalkirkSubstantial","Falkirk","Substantial","AprtoJun13",0,0,0,0,0,0,0,0,0,0,0,0]
["AprtoJun13FalkirkModerate","Falkirk","Moderate","AprtoJun13",0,0,0,0,0,0,0,0,0,0,0,0]
["AprtoJun13FalkirkLow or No Risk","Falkirk","Low or No Risk","AprtoJun13",0,0,0,0,0,0,0,0,0,0,0,0]
["AprtoJun13FalkirkNot available","Falkirk","Not available","AprtoJun13",0,0,0,0,0,0,0,0,0,0,0,0]
["AprtoJun13FalkirkTotals","Falkirk","Totals","AprtoJun13",0,0,0,0,0,0,0,0,0,0,0,0]
["AprtoJun13FifeCritical","Fife","Critical","AprtoJun13",0.1,0.48,0.22,0.08,0.12,1,0.03,0.45,0.28000000000000003,0.05,0.2,1]
["AprtoJun13FifeSubstantial","Fife","Substantial","AprtoJun13",0.05,0.3,0.17,0.15,0.32,1,0.09,0.49,0.19,0.09,0.14000000000000001,1]
["AprtoJun13FifeModerate","Fife","Moderate","AprtoJun13",0.02,0.08,7.0000000000000007E-2,0.12,0.72,1,0,0.45,0.27,0.18,0.09,1]
["AprtoJun13FifeLow or No Risk","Fife","Low or No Risk","AprtoJun13",0,0.06,0.16,0.06,0.72,1,0,0,0,0,0,0]
["AprtoJun13FifeNot available","Fife","Not available","AprtoJun13",0.25,0.5,0.25,0,0,1,0,0,0,0,0,0]
["AprtoJun13FifeTotals","Fife","Totals","AprtoJun13",0.05,0.24,0.14000000000000001,0.13,0.45,1,0.08,0.48,0.21,0.09,0.14000000000000001,1]
["AprtoJun13Glasgow CityCritical","Glasgow City","Critical","AprtoJun13",0.02,0.15,0.16,0.05,0.63,1,0,1,0,0,0,1]
["AprtoJun13Glasgow CitySubstantial","Glasgow City","Substantial","AprtoJun13",0.06,0.1,0.12,0.08,0.64,1,0,1,0,0,0,1]
["AprtoJun13Glasgow CityModerate","Glasgow City","Moderate","AprtoJun13",0.1,0.24,0.04,0.05,0.56999999999999995,1,0,1,0,0,0,1]
["AprtoJun13Glasgow CityLow or No Risk","Glasgow City","Low or No Risk","AprtoJun13",0.1,0.28999999999999998,0.1,0.05,0.48,1,0,1,0,0,0,1]
["AprtoJun13Glasgow CityNot available","Glasgow City","Not available","AprtoJun13",0.14000000000000001,0.48,7.0000000000000007E-2,0.09,0.22,1,0,1,0,0,0,1]
["AprtoJun13Glasgow CityTotals","Glasgow City","Totals","AprtoJun13",0.09,0.25,0.09,7.0000000000000007E-2,0.5,1,0,1,0,0,0,1]
["AprtoJun13HighlandCritical","Highland","Critical","AprtoJun13",0.17,0.25,0.15,0.15,0.28000000000000003,1,0,0,0,0,0,0]
["AprtoJun13HighlandSubstantial","Highland","Substantial","AprtoJun13",0.18,0.05,0.16,0.2,0.41,1,0,0,0,0,0,0]
["AprtoJun13HighlandModerate","Highland","Moderate","AprtoJun13",0.08,0.12,0.15,0.13,0.52,1,0,0,0,0,0,0]
["AprtoJun13HighlandLow or No Risk","Highland","Low or No Risk","AprtoJun13",0,0,0.2,0.1,0.7,1,0,0,0,0,0,0]
["AprtoJun13HighlandNot available","Highland","Not available","AprtoJun13",0.09,0.13,0.28000000000000003,0.11,0.39,1,0,0,0,0,0,0]
["AprtoJun13HighlandTotals","Highland","Totals","AprtoJun13",0.12,0.12,0.18,0.15,0.43,1,0,0,0,0,0,0]
["AprtoJun13InverclydeCritical","Inverclyde","Critical","AprtoJun13",0,0.5,0.1,0.2,0.2,1,0.37,0.44,0.15,0.04,0,1]
["AprtoJun13InverclydeSubstantial","Inverclyde","Substantial","AprtoJun13",0.5,0,0.5,0,0,1,0.22,0.78,0,0,0,1]
["AprtoJun13InverclydeModerate","Inverclyde","Moderate","AprtoJun13",0.28999999999999998,0.21,0.21,7.0000000000000007E-2,0.21,1,0.42,0.42,0.16,0,0,1]
["AprtoJun13InverclydeLow or No Risk","Inverclyde","Low or No Risk","AprtoJun13",0.5,0.2,0,0,0.3,1,0,0,0,0,0,0]
["AprtoJun13InverclydeNot available","Inverclyde","Not available","AprtoJun13",0.09,0.36,0.09,0.09,0.36,1,0.75,0.25,0,0,0,1]
["AprtoJun13InverclydeTotals","Inverclyde","Totals","AprtoJun13",0.23,0.3,0.13,0.09,0.26,1,0.39,0.47,0.12,0.02,0,1]
["AprtoJun13MidlothianCritical","Midlothian","Critical","AprtoJun13",0,0,0,0,0,0,0,0,0,0,0,0]
["AprtoJun13MidlothianSubstantial","Midlothian","Substantial","AprtoJun13",0,0,0,0,0,0,0,0,0,0,0,0]
["AprtoJun13MidlothianModerate","Midlothian","Moderate","AprtoJun13",0,0,0,0,0,0,0,0,0,0,0,0]
["AprtoJun13MidlothianLow or No Risk","Midlothian","Low or No Risk","AprtoJun13",0,0,0,0,0,0,0,0,0,0,0,0]
["AprtoJun13MidlothianNot available","Midlothian","Not available","AprtoJun13",0.02,0.2,0.33,0.1,0.36,1,0,0,0,0,0,0]
["AprtoJun13MidlothianTotals","Midlothian","Totals","AprtoJun13",0.02,0.2,0.33,0.1,0.36,1,0,0,0,0,0,0]
["AprtoJun13MorayCritical","Moray","Critical","AprtoJun13",0.6,0.4,0,0,0,1,0,1,0,0,0,1]
["AprtoJun13MoraySubstantial","Moray","Substantial","AprtoJun13",0.05,0.52,0.43,0,0,1,0.33,0.56000000000000005,0.11,0,0,1]
["AprtoJun13MorayModerate","Moray","Moderate","AprtoJun13",0.22,0.38,0.3,0.11,0,1,0.33,0.33,0.33,0,0,1]
["AprtoJun13MorayLow or No Risk","Moray","Low or No Risk","AprtoJun13",0.28999999999999998,0.43,0.25,0,0.04,1,0,0.33,0,0.33,0.33,1]
["AprtoJun13MorayNot available","Moray","Not available","AprtoJun13",0,0,0,0,0,0,0,0,0,0,0,0]
["AprtoJun13MorayTotals","Moray","Totals","AprtoJun13",0.22,0.43,0.3,0.04,0.01,1,0.21,0.57999999999999996,0.11,0.05,0.05,1]
["AprtoJun13North AyrshireCritical","North Ayrshire","Critical","AprtoJun13",0,0.73,0.27,0,0,1,0.25,0.44,0.25,0.06,0,1]
["AprtoJun13North AyrshireSubstantial","North Ayrshire","Substantial","AprtoJun13",0.03,0.41,0.15,0.06,0.35,1,0.61,0.37,0.02,0,0,1]
["AprtoJun13North AyrshireModerate","North Ayrshire","Moderate","AprtoJun13",0,0,0.25,0.25,0.5,1,0.75,0.25,0,0,0,1]
["AprtoJun13North AyrshireLow or No Risk","North Ayrshire","Low or No Risk","AprtoJun13",0,0.56000000000000005,0.11,0.11,0.22,1,1,0,0,0,0,1]
["AprtoJun13North AyrshireNot available","North Ayrshire","Not available","AprtoJun13",0,0,0,0,1,1,0,0,0,0,0,0]
["AprtoJun13North AyrshireTotals","North Ayrshire","Totals","AprtoJun13",0.02,0.43,0.17,0.08,0.3,1,0.55000000000000004,0.37,7.0000000000000007E-2,0.01,0,1]
["AprtoJun13North LanarkshireCritical","North Lanarkshire","Critical","AprtoJun13",0.71,0.21,0.04,0.02,0.02,1,0.28000000000000003,0.65,0.06,0.01,0.01,1]
["AprtoJun13North LanarkshireSubstantial","North Lanarkshire","Substantial","AprtoJun13",0.45,0.3,0.11,0.03,0.11,1,0.53,0.42,0.02,0.01,0.01,1]
["AprtoJun13North LanarkshireModerate","North Lanarkshire","Moderate","AprtoJun13",0.52,0.3,0.03,0.03,0.12,1,0.45,0.49,0,0.02,0.04,1]
["AprtoJun13North LanarkshireLow or No Risk","North Lanarkshire","Low or No Risk","AprtoJun13",0.51,0.21,0.14000000000000001,0.02,0.12,1,0.33,0.67,0,0,0,1]
["AprtoJun13North LanarkshireNot available","North Lanarkshire","Not available","AprtoJun13",0,0,0,0,0,0,0,0,0,0,0,0]
["AprtoJun13North LanarkshireTotals","North Lanarkshire","Totals","AprtoJun13",0.59,0.25,0.06,0.02,7.0000000000000007E-2,1,0.36,0.57999999999999996,0.04,0.01,0.01,1]
["AprtoJun13Orkney islandsCritical","Orkney islands","Critical","AprtoJun13",0,0,0,0,0,0,0,0,0,0,0,0]
["AprtoJun13Orkney islandsSubstantial","Orkney islands","Substantial","AprtoJun13",0,0,0,0,0,0,0,0,0,0,0,0]
["AprtoJun13Orkney islandsModerate","Orkney islands","Moderate","AprtoJun13",0,0,0,0,0,0,0,0,0,0,0,0]
["AprtoJun13Orkney islandsLow or No Risk","Orkney islands","Low or No Risk","AprtoJun13",0,0,0,0,0,0,0,0,0,0,0,0]
["AprtoJun13Orkney islandsNot available","Orkney islands","Not available","AprtoJun13",0,0,0,0,0,0,0,0,0,0,0,0]
["AprtoJun13Orkney islandsTotals","Orkney islands","Totals","AprtoJun13",0,0,0,0,0,0,0,0,0,0,0,0]
["AprtoJun13Perth & KinrossCritical","Perth & Kinross","Critical","AprtoJun13",0.73,0.18,0.09,0,0,1,0.14000000000000001,0.86,0,0,0,1]
["AprtoJun13Perth & KinrossSubstantial","Perth & Kinross","Substantial","AprtoJun13",0.32,0.28999999999999998,0.16,0.08,0.16,1,0.04,0.48,0.13,0.09,0.26,1]
["AprtoJun13Perth & KinrossModerate","Perth & Kinross","Moderate","AprtoJun13",0.33,0.11,0.17,0.08,0.31,1,0.08,0.57999999999999996,0.19,0.08,0.08,1]
["AprtoJun13Perth & KinrossLow or No Risk","Perth & Kinross","Low or No Risk","AprtoJun13",0.09,0.18,0.27,0.09,0.36,1,0,0,0,0,0,0]
["AprtoJun13Perth & KinrossNot available","Perth & Kinross","Not available","AprtoJun13",0.19,0.31,0.12,0.1,0.28999999999999998,1,0,0,0,0,0,0]
["AprtoJun13Perth & KinrossTotals","Perth & Kinross","Totals","AprtoJun13",0.31,0.18,0.16,0.08,0.26,1,7.0000000000000007E-2,0.56999999999999995,0.14000000000000001,7.0000000000000007E-2,0.14000000000000001,1]
["AprtoJun13RenfrewshireCritical","Renfrewshire","Critical","AprtoJun13",0.67,0.28999999999999998,0.05,0,0,1,0.36,0.53,0.08,0,0.03,1]
["AprtoJun13RenfrewshireSubstantial","Renfrewshire","Substantial","AprtoJun13",0.56000000000000005,0.31,0.08,0,0.06,1,0.35,0.4,0.14000000000000001,0.02,0.09,1]
["AprtoJun13RenfrewshireModerate","Renfrewshire","Moderate","AprtoJun13",0.75,0.13,0.13,0,0,1,1,0,0,0,0,1]
["AprtoJun13RenfrewshireLow or No Risk","Renfrewshire","Low or No Risk","AprtoJun13",0.71,0,0,0,0.28999999999999998,1,0.75,0,0.25,0,0,1]
["AprtoJun13RenfrewshireNot available","Renfrewshire","Not available","AprtoJun13",0.59,0.16,0.03,0.03,0.19,1,0.7,0.2,0.05,0.03,0.03,1]
["AprtoJun13RenfrewshireTotals","Renfrewshire","Totals","AprtoJun13",0.6,0.19,0.04,0.02,0.15,1,0.57999999999999996,0.28999999999999998,7.0000000000000007E-2,0.02,0.04,1]
["AprtoJun13Scottish BordersCritical","Scottish Borders","Critical","AprtoJun13",0.25,0.22,0.15,0.11,0.28000000000000003,1,7.0000000000000007E-2,0.66,0.16,0.1,0.01,1]
["AprtoJun13Scottish BordersSubstantial","Scottish Borders","Substantial","AprtoJun13",0.06,0.13,0.13,0.11,0.56999999999999995,1,0,1,0,0,0,1]
["AprtoJun13Scottish BordersModerate","Scottish Borders","Moderate","AprtoJun13",0,0,0,0,1,1,0,0,0,0,1,1]
["AprtoJun13Scottish BordersLow or No Risk","Scottish Borders","Low or No Risk","AprtoJun13",0,0.17,0.17,0,0.67,1,0,0,0,0,0,0]
["AprtoJun13Scottish BordersNot available","Scottish Borders","Not available","AprtoJun13",0,0,0,0,0,0,0,0,0,0,0,0]
["AprtoJun13Scottish BordersTotals","Scottish Borders","Totals","AprtoJun13",0.2,0.2,0.14000000000000001,0.11,0.35,1,7.0000000000000007E-2,0.66,0.15,0.09,0.02,1]
["AprtoJun13Shetland islandsCritical","Shetland islands","Critical","AprtoJun13",0.13,0.38,0.25,0.25,0,1,0.25,0.67,0.08,0,0,1]
["AprtoJun13Shetland islandsSubstantial","Shetland islands","Substantial","AprtoJun13",0,1,0,0,0,1,0.23,0.77,0,0,0,1]
["AprtoJun13Shetland islandsModerate","Shetland islands","Moderate","AprtoJun13",0.67,0,0,0,0.33,1,0.5,0.5,0,0,0,1]
["AprtoJun13Shetland islandsLow or No Risk","Shetland islands","Low or No Risk","AprtoJun13",0,0,0,0,0,0,1,0,0,0,0,1]
["AprtoJun13Shetland islandsNot available","Shetland islands","Not available","AprtoJun13",0.08,0.42,0.27,0.04,0.19,1,0.13,0.88,0,0,0,1]
["AprtoJun13Shetland islandsTotals","Shetland islands","Totals","AprtoJun13",0.13,0.43,0.23,0.08,0.15,1,0.28000000000000003,0.7,0.03,0,0,1]
["AprtoJun13South AyrshireCritical","South Ayrshire","Critical","AprtoJun13",0.26,0.45,0.23,0.04,0.02,1,0.63,0.25,0.12,0,0,1]
["AprtoJun13South AyrshireSubstantial","South Ayrshire","Substantial","AprtoJun13",0.38,0.19,0.31,0.06,0.06,1,0.17,0.65,0.17,0,0,1]
["AprtoJun13South AyrshireModerate","South Ayrshire","Moderate","AprtoJun13",0.37,0.43,0.18,0.02,0,1,0.45,0.45,0.1,0,0,1]
["AprtoJun13South AyrshireLow or No Risk","South Ayrshire","Low or No Risk","AprtoJun13",0.22,0.38,0.15,0.2,0.05,1,0.64,0.21,0.15,0,0,1]
["AprtoJun13South AyrshireNot available","South Ayrshire","Not available","AprtoJun13",0,0,0,0,0,0,0,0,0,0,0,0]
["AprtoJun13South AyrshireTotals","South Ayrshire","Totals","AprtoJun13",0.28999999999999998,0.4,0.2,0.09,0.03,1,0.52,0.35,0.13,0,0,1]
["AprtoJun13South LanarkshireCritical","South Lanarkshire","Critical","AprtoJun13",0,0,0,0,0,0,0,0,0,0,0,0]
["AprtoJun13South LanarkshireSubstantial","South Lanarkshire","Substantial","AprtoJun13",0,0,0,0,0,0,0,0,0,0,0,0]
["AprtoJun13South LanarkshireModerate","South Lanarkshire","Moderate","AprtoJun13",0,0,0,0,0,0,0,0,0,0,0,0]
["AprtoJun13South LanarkshireLow or No Risk","South Lanarkshire","Low or No Risk","AprtoJun13",0,0,0,0,0,0,0,0,0,0,0,0]
["AprtoJun13South LanarkshireNot available","South Lanarkshire","Not available","AprtoJun13",0,0,0,0,0,0,0,0,0,0,0,0]
["AprtoJun13South LanarkshireTotals","South Lanarkshire","Totals","AprtoJun13",0,0,0,0,0,0,0,0,0,0,0,0]
["AprtoJun13StirlingCritical","Stirling","Critical","AprtoJun13",0.31,0.11,0.23,0.17,0.17,1,0.54,0.31,0.12,0.04,0,1]
["AprtoJun13StirlingSubstantial","Stirling","Substantial","AprtoJun13",0.33,0.1,0.05,0.08,0.44,1,0.33,0.5,0.17,0,0,1]
["AprtoJun13StirlingModerate","Stirling","Moderate","AprtoJun13",0,0,0,0,1,1,0.33,0,0.33,0,0.33,1]
["AprtoJun13StirlingLow or No Risk","Stirling","Low or No Risk","AprtoJun13",0,0,0,0,1,1,0,0,0,0,0,0]
["AprtoJun13StirlingNot available","Stirling","Not available","AprtoJun13",0.22,0.26,0.18,0.08,0.26,1,0.42,0.25,0.17,0.17,0,1]
["AprtoJun13StirlingTotals","Stirling","Totals","AprtoJun13",0.27,0.16,0.15,0.1,0.33,1,0.46,0.28999999999999998,0.15,0.08,0.02,1]
["AprtoJun13West DunbartonshireCritical","West Dunbartonshire","Critical","AprtoJun13",0.5,0.27,0.05,0.09,0.09,1,0.81,0.19,0,0,0,1]
["AprtoJun13West DunbartonshireSubstantial","West Dunbartonshire","Substantial","AprtoJun13",0.72,0.16,0.05,0.02,0.06,1,0.76,0.24,0,0,0,1]
["AprtoJun13West DunbartonshireModerate","West Dunbartonshire","Moderate","AprtoJun13",0.12,0.17,0.28000000000000003,0.11,0.33,1,0.7,0.25,0.05,0,0,1]
["AprtoJun13West DunbartonshireLow or No Risk","West Dunbartonshire","Low or No Risk","AprtoJun13",0.05,0.18,0.11,0.32,0.35,1,0.7,0.3,0,0,0,1]
["AprtoJun13West DunbartonshireNot available","West Dunbartonshire","Not available","AprtoJun13",0,0,0,0,0,0,0,0,0,0,0,0]
["AprtoJun13West DunbartonshireTotals","West Dunbartonshire","Totals","AprtoJun13",0.43,0.17,0.12,0.1,0.18,1,0.75,0.23,0.02,0,0,1]
["AprtoJun13West LothianCritical","West Lothian","Critical","AprtoJun13",0,0,0,0,0,0,0,0,0,0,0,0]
["AprtoJun13West LothianSubstantial","West Lothian","Substantial","AprtoJun13",0,0,0,0,0,0,0,0,0,0,0,0]
["AprtoJun13West LothianModerate","West Lothian","Moderate","AprtoJun13",0,0,0,0,0,0,0,0,0,0,0,0]
["AprtoJun13West LothianLow or No Risk","West Lothian","Low or No Risk","AprtoJun13",0,0,0,0,0,0,0,0,0,0,0,0]
["AprtoJun13West LothianNot available","West Lothian","Not available","AprtoJun13",0,0,0,0,0,0,0,0,0,0,0,0]
["AprtoJun13West LothianTotals","West Lothian","Totals","AprtoJun13",0,0,0,0,0,0,0,0,0,0,0,0]
["AprtoJun13SCOTLAND TOTALSCritical","SCOTLAND TOTALS","Critical","AprtoJun13",0.36,0.28000000000000003,0.13,7.0000000000000007E-2,0.16,1,0.35,0.48,0.09,0.03,0.04,1]
["AprtoJun13SCOTLAND TOTALSSubstantial","SCOTLAND TOTALS","Substantial","AprtoJun13",0.25,0.24,0.14000000000000001,0.09,0.28999999999999998,1,0.22,0.57999999999999996,0.09,0.04,0.06,1]
["AprtoJun13SCOTLAND TOTALSModerate","SCOTLAND TOTALS","Moderate","AprtoJun13",0.19,0.22,0.12,0.09,0.39,1,0.34,0.56000000000000005,0.05,0.02,0.03,1]
["AprtoJun13SCOTLAND TOTALSLow or No Risk","SCOTLAND TOTALS","Low or No Risk","AprtoJun13",0.23,0.21,0.12,0.11,0.33,1,0.36,0.56000000000000005,0.05,0.03,0.01,1]
["AprtoJun13SCOTLAND TOTALSNot available","SCOTLAND TOTALS","Not available","AprtoJun13",0.22,0.28999999999999998,0.22,0.1,0.17,1,0.22,0.64,0.08,0.04,0.02,1]
["AprtoJun13SCOTLAND TOTALSTotals","SCOTLAND TOTALS","Totals","AprtoJun13",0.24,0.26,0.16,0.09,0.25,1,0.26,0.57999999999999996,0.08,0.03,0.04,1]
["JultoSep13Aberdeen CityCritical","Aberdeen City","Critical","JultoSep13",0.22,0.11,0.22,0,0.44,1,0.25,0.75,0,0,0,1]
["JultoSep13Aberdeen CitySubstantial","Aberdeen City","Substantial","JultoSep13",0.18,0.36,0.18,0.11,0.18,1,0.15,0.46,0.15,0.23,0,1]
["JultoSep13Aberdeen CityModerate","Aberdeen City","Moderate","JultoSep13",0,0.17,0.17,0.17,0.5,1,0,1,0,0,0,1]
["JultoSep13Aberdeen CityLow or No Risk","Aberdeen City","Low or No Risk","JultoSep13",0,0,0.5,0,0.5,1,0,0,0,0,0,0]
["JultoSep13Aberdeen CityNot available","Aberdeen City","Not available","JultoSep13",0,0.6,0.4,0,0,1,0,0,0,0,0,0]
["JultoSep13Aberdeen CityTotals","Aberdeen City","Totals","JultoSep13",0.15,0.31,0.21,0.09,0.24,1,0.17,0.56000000000000005,0.11,0.17,0,1]
["JultoSep13AberdeenshireCritical","Aberdeenshire","Critical","JultoSep13",0,0.5,0.5,0,0,1,0,0,0,0,0,0]
["JultoSep13AberdeenshireSubstantial","Aberdeenshire","Substantial","JultoSep13",0,0.63,0.13,0.13,0.13,1,0,0,0,0,0,0]
["JultoSep13AberdeenshireModerate","Aberdeenshire","Moderate","JultoSep13",0.2,0.4,0,0.4,0,1,0,0,0,0,0,0]
["JultoSep13AberdeenshireLow or No Risk","Aberdeenshire","Low or No Risk","JultoSep13",0,0.5,0.17,0.17,0.17,1,0,0,0,0,0,0]
["JultoSep13AberdeenshireNot available","Aberdeenshire","Not available","JultoSep13",7.0000000000000007E-2,0.33,0.2,0.08,0.33,1,0,0,0,0,0,0]
[{"$f":"D1994&B1994&C1994","v":"JultoSep13AberdeenshireTotals"},"Aberdeenshire","Totals","JultoSep13",7.0000000000000007E-2,0.34,0.2,0.09,0.3,1,0,0,0,0,0,0]
["JultoSep13AngusCritical","Angus","Critical","JultoSep13",0.23,0.13,0.03,0.35,0.26,1,0.39,0.39,0.03,0.1,0.1,1]
["JultoSep13AngusSubstantial","Angus","Substantial","JultoSep13",0.66,0.11,0.09,0.06,0.09,1,0.3,0.63,0.05,0.01,0,1]
["JultoSep13AngusModerate","Angus","Moderate","JultoSep13",0.69,0.03,0.1,0.08,0.1,1,0.22,0.66,0.06,0.06,0,1]
["JultoSep13AngusLow or No Risk","Angus","Low or No Risk","JultoSep13",0.86,7.0000000000000007E-2,0,0.02,0.05,1,0.08,0.9,0,0.02,0,1]
["JultoSep13AngusNot available","Angus","Not available","JultoSep13",0.2,0,0.1,0.1,0.6,1,0,0,0,0,0,0]
["JultoSep13AngusTotals","Angus","Totals","JultoSep13",0.63,0.08,0.05,0.1,0.13,1,0.24,0.68,0.04,0.04,0.02,1]
["JultoSep13Argyll & ButeCritical","Argyll & Bute","Critical","JultoSep13",0.44,0.35,0.12,0.04,0.05,1,0.33,0.37,0.05,0.02,0.23,1]
["JultoSep13Argyll & ButeSubstantial","Argyll & Bute","Substantial","JultoSep13",0.24,0.27,0.18,0.13,0.18,1,0.26,0.2,0.09,0.04,0.41,1]
["JultoSep13Argyll & ButeModerate","Argyll & Bute","Moderate","JultoSep13",0.61,0.24,0.04,0.04,0.08,1,0,0,0,1,0,1]
["JultoSep13Argyll & ButeLow or No Risk","Argyll & Bute","Low or No Risk","JultoSep13",0,0,0,0.67,0.33,1,0,0,0,0,0,0]
["JultoSep13Argyll & ButeNot available","Argyll & Bute","Not available","JultoSep13",0,0,0,0,0,0,1,0,0,0,0,1]
["JultoSep13Argyll & ButeTotals","Argyll & Bute","Totals","JultoSep13",0.36,0.28999999999999998,0.14000000000000001,0.09,0.12,1,0.3,0.25,7.0000000000000007E-2,0.05,0.33,1]
["JultoSep13ClackmannanshireCritical","Clackmannanshire","Critical","JultoSep13",0,0,0,0,0,0,0,0,0,0,0,0]
["JultoSep13ClackmannanshireSubstantial","Clackmannanshire","Substantial","JultoSep13",0.12,0.4,0.12,0,0.36,1,0,0,0,0,0,0]
["JultoSep13ClackmannanshireModerate","Clackmannanshire","Moderate","JultoSep13",0,0.2,0.2,0.08,0.52,1,0,0,0,0,0,0]
["JultoSep13ClackmannanshireLow or No Risk","Clackmannanshire","Low or No Risk","JultoSep13",0.02,0,0.06,0.04,0.88,1,0,0,0,0,0,0]
["JultoSep13ClackmannanshireNot available","Clackmannanshire","Not available","JultoSep13",0,0,0,0,0,0,0.78,0.2,0.02,0,0,1]
["JultoSep13ClackmannanshireTotals","Clackmannanshire","Totals","JultoSep13",0.04,0.15,0.11,0.04,0.66,1,0.78,0.2,0.02,0,0,1]
["JultoSep13Dumfries and GallowayCritical","Dumfries and Galloway","Critical","JultoSep13",0,0,0,0,0,0,0,0,0,0,0,0]
["JultoSep13Dumfries and GallowaySubstantial","Dumfries and Galloway","Substantial","JultoSep13",0,0,0,0,0,0,0,0,0,0,0,0]
["JultoSep13Dumfries and GallowayModerate","Dumfries and Galloway","Moderate","JultoSep13",0,0,0,0,0,0,0,0,0,0,0,0]
["JultoSep13Dumfries and GallowayLow or No Risk","Dumfries and Galloway","Low or No Risk","JultoSep13",0,0,0,0,0,0,0,0,0,0,0,0]
["JultoSep13Dumfries and GallowayNot available","Dumfries and Galloway","Not available","JultoSep13",0.3,0.5,0.08,0.05,0.08,1,0.04,0.57999999999999996,0.21,0.08,0.09,1]
["JultoSep13Dumfries and GallowayTotals","Dumfries and Galloway","Totals","JultoSep13",0.3,0.5,0.08,0.05,0.08,1,0.04,0.57999999999999996,0.21,0.08,0.09,1]
["JultoSep13Dundee CityCritical","Dundee City","Critical","JultoSep13",0.31,0.31,0.31,0,0.06,1,0.45,0.27,0.18,0.09,0,1]
["JultoSep13Dundee CitySubstantial","Dundee City","Substantial","JultoSep13",0.17,0.31,0.31,0.1,0.1,1,0.44,0.28000000000000003,0.11,0.06,0.11,1]
["JultoSep13Dundee CityModerate","Dundee City","Moderate","JultoSep13",0.11,0.42,0.19,0.08,0.21,1,0.53,0.22,0.09,0.09,7.0000000000000007E-2,1]
["JultoSep13Dundee CityLow or No Risk","Dundee City","Low or No Risk","JultoSep13",0.14000000000000001,0.23,0.18,0.18,0.27,1,1,0,0,0,0,1]
["JultoSep13Dundee CityNot available","Dundee City","Not available","JultoSep13",0,0.14000000000000001,0,0.14000000000000001,0.71,1,1,0,0,0,0,1]
["JultoSep13Dundee CityTotals","Dundee City","Totals","JultoSep13",0.13,0.38,0.2,0.08,0.21,1,0.61,0.19,0.08,0.06,0.05,1]
["JultoSep13East AyrshireCritical","East Ayrshire","Critical","JultoSep13",0.52,0.42,0.03,0,0.02,1,0.42,0.55000000000000004,0.03,0,0,1]
["JultoSep13East AyrshireSubstantial","East Ayrshire","Substantial","JultoSep13",0.19,0.32,0.19,0.12,0.19,1,0.35,0.48,0.1,0.06,0,1]
["JultoSep13East AyrshireModerate","East Ayrshire","Moderate","JultoSep13",0.31,0.27,0.08,0.11,0.23,1,0.47,0.38,0.09,0.06,0,1]
["JultoSep13East AyrshireLow or No Risk","East Ayrshire","Low or No Risk","JultoSep13",0,0,0.33,0,0.67,1,1,0,0,0,0,1]
["JultoSep13East AyrshireNot available","East Ayrshire","Not available","JultoSep13",0,0,0,0,0,0,0,0,0,0,0,0]
["JultoSep13East AyrshireTotals","East Ayrshire","Totals","JultoSep13",0.38,0.35,0.08,0.06,0.13,1,0.42,0.48,0.06,0.04,0,1]
["JultoSep13East DunbartonshireCritical","East Dunbartonshire","Critical","JultoSep13",0.35,0.45,0,0.2,0,1,0,1,0,0,0,1]
["JultoSep13East DunbartonshireSubstantial","East Dunbartonshire","Substantial","JultoSep13",0.51,0.2,0.16,0.05,0.08,1,0,0.97,0.03,0,0,1]
["JultoSep13East DunbartonshireModerate","East Dunbartonshire","Moderate","JultoSep13",0.53,0.2,0.13,7.0000000000000007E-2,7.0000000000000007E-2,1,0,1,0,0,0,1]
["JultoSep13East DunbartonshireLow or No Risk","East Dunbartonshire","Low or No Risk","JultoSep13",0,0.5,0.5,0,0,1,0,1,0,0,0,1]
["JultoSep13East DunbartonshireNot available","East Dunbartonshire","Not available","JultoSep13",0.33,0.67,0,0,0,1,0,0,0,0,0,0]
["JultoSep13East DunbartonshireTotals","East Dunbartonshire","Totals","JultoSep13",0.48,0.25,0.14000000000000001,7.0000000000000007E-2,7.0000000000000007E-2,1,0,0.97,0.03,0,0,1]
["JultoSep13East LothianCritical","East Lothian","Critical","JultoSep13",0,0,0,0,0,0,0,1,0,0,0,1]
["JultoSep13East LothianSubstantial","East Lothian","Substantial","JultoSep13",0.27,0.22,0.2,0.11,0.21,1,0.16,0.45,0.27,0.08,0.03,1]
["JultoSep13East LothianModerate","East Lothian","Moderate","JultoSep13",0,0,0,0,0,0,0,0,0,0,0,0]
["JultoSep13East LothianLow or No Risk","East Lothian","Low or No Risk","JultoSep13",0,0,0,0,0,0,0,0,0,0,0,0]
["JultoSep13East LothianNot available","East Lothian","Not available","JultoSep13",0,0,0,0,0,0,0,0,0,0,0,0]
["JultoSep13East LothianTotals","East Lothian","Totals","JultoSep13",0.27,0.22,0.2,0.11,0.21,1,0.16,0.47,0.26,0.08,0.03,1]
["JultoSep13East RenfrewshireCritical","East Renfrewshire","Critical","JultoSep13",0,0,0,0,0,0,0,0,0,0,0,0]
["JultoSep13East RenfrewshireSubstantial","East Renfrewshire","Substantial","JultoSep13",0,0,0,0,0,0,0,0,0,0,0,0]
["JultoSep13East RenfrewshireModerate","East Renfrewshire","Moderate","JultoSep13",0,0,0,0,0,0,0,0,0,0,0,0]
["JultoSep13East RenfrewshireLow or No Risk","East Renfrewshire","Low or No Risk","JultoSep13",0,0,0,0,0,0,0,0,0,0,0,0]
["JultoSep13East RenfrewshireNot available","East Renfrewshire","Not available","JultoSep13",0,0,0,0,0,0,0,0,0,0,0,0]
["JultoSep13East RenfrewshireTotals","East Renfrewshire","Totals","JultoSep13",0,0,0,0,0,0,0,0,0,0,0,0]
["JultoSep13Edinburgh, City ofCritical","Edinburgh, City of","Critical","JultoSep13",0,0,0,0,0,0,0,0,0,0,0,0]
["JultoSep13Edinburgh, City ofSubstantial","Edinburgh, City of","Substantial","JultoSep13",0,0,0,0,0,0,0,0,0,0,0,0]
["JultoSep13Edinburgh, City ofModerate","Edinburgh, City of","Moderate","JultoSep13",0,0,0,0,0,0,0,0,0,0,0,0]
["JultoSep13Edinburgh, City ofLow or No Risk","Edinburgh, City of","Low or No Risk","JultoSep13",0,0,0,0,0,0,0,0,0,0,0,0]
["JultoSep13Edinburgh, City ofNot available","Edinburgh, City of","Not available","JultoSep13",0.21,0.2,0.16,0.2,0.23,1,0.01,0.77,0.14000000000000001,0.06,0.02,1]
["JultoSep13Edinburgh, City ofTotals","Edinburgh, City of","Totals","JultoSep13",0.21,0.2,0.16,0.2,0.23,1,0.01,0.77,0.14000000000000001,0.06,0.02,1]
["JultoSep13Eilean SiarCritical","Eilean Siar","Critical","JultoSep13",0,0,0,0,0,0,0,0,0,0,0,0]
["JultoSep13Eilean SiarSubstantial","Eilean Siar","Substantial","JultoSep13",0,0.67,0.33,0,0,1,0.33,0.67,0,0,0,1]
["JultoSep13Eilean SiarModerate","Eilean Siar","Moderate","JultoSep13",0,0,0,0,0,0,0,0,0,0,0,0]
[{"$f":"D2058&B2058&C2058","v":"JultoSep13Eilean SiarLow or No Risk"},"Eilean Siar","Low or No Risk","JultoSep13",0,0,0,0,0,0,0,0,0,0,0,0]
["JultoSep13Eilean SiarNot available","Eilean Siar","Not available","JultoSep13",0,0.25,0.5,0.25,0,1,0.14000000000000001,0.43,0.28999999999999998,0.14000000000000001,0,1]
["JultoSep13Eilean SiarTotals","Eilean Siar","Totals","JultoSep13",0,0.36,0.45,0.18,0,1,0.2,0.5,0.2,0.1,0,1]
["JultoSep13FalkirkCritical","Falkirk","Critical","JultoSep13",0,0,0,0,0,0,0,0,0,0,0,0]
["JultoSep13FalkirkSubstantial","Falkirk","Substantial","JultoSep13",0,0,0,0,0,0,0,0,0,0,0,0]
["JultoSep13FalkirkModerate","Falkirk","Moderate","JultoSep13",0,0,0,0,0,0,0,0,0,0,0,0]
["JultoSep13FalkirkLow or No Risk","Falkirk","Low or No Risk","JultoSep13",0,0,0,0,0,0,0,0,0,0,0,0]
["JultoSep13FalkirkNot available","Falkirk","Not available","JultoSep13",0,0,0,0,0,0,0,0,0,0,0,0]
["JultoSep13FalkirkTotals","Falkirk","Totals","JultoSep13",0,0,0,0,0,0,0,0,0,0,0,0]
["JultoSep13FifeCritical","Fife","Critical","JultoSep13",0.06,0.62,0.14000000000000001,0.09,0.09,1,0.12,0.56000000000000005,0.19,0.09,0.04,1]
["JultoSep13FifeSubstantial","Fife","Substantial","JultoSep13",0.04,0.22,0.21,0.16,0.37,1,0.18,0.39,0.27,0.11,0.05,1]
["JultoSep13FifeModerate","Fife","Moderate","JultoSep13",0.01,0.05,0.06,0.14000000000000001,0.73,1,0.08,0.38,0.46,0,0.08,1]
["JultoSep13FifeLow or No Risk","Fife","Low or No Risk","JultoSep13",0,0.05,0.05,0.05,0.85,1,0,0.5,0.5,0,0,1]
["JultoSep13FifeNot available","Fife","Not available","JultoSep13",0,0,0,0,0,0,0,0,0,0,0,0]
["JultoSep13FifeTotals","Fife","Totals","JultoSep13",0.03,0.21,0.14000000000000001,0.14000000000000001,0.48,1,0.16,0.43,0.27,0.1,0.05,1]
["JultoSep13Glasgow CityCritical","Glasgow City","Critical","JultoSep13",0.02,0.14000000000000001,0.16,0.04,0.63,1,0,1,0,0,0,1]
["JultoSep13Glasgow CitySubstantial","Glasgow City","Substantial","JultoSep13",0.06,0.1,0.12,0.08,0.64,1,0,1,0,0,0,1]
["JultoSep13Glasgow CityModerate","Glasgow City","Moderate","JultoSep13",0.1,0.24,0.04,0.05,0.56999999999999995,1,0,1,0,0,0,1]
["JultoSep13Glasgow CityLow or No Risk","Glasgow City","Low or No Risk","JultoSep13",0.09,0.3,0.09,0.04,0.48,1,0,1,0,0,0,1]
["JultoSep13Glasgow CityNot available","Glasgow City","Not available","JultoSep13",0.14000000000000001,0.48,7.0000000000000007E-2,0.09,0.22,1,0,1,0,0,0,1]
["JultoSep13Glasgow CityTotals","Glasgow City","Totals","JultoSep13",0.09,0.25,0.09,7.0000000000000007E-2,0.5,1,0,1,0,0,0,1]
["JultoSep13HighlandCritical","Highland","Critical","JultoSep13",0,0,0,0,1,1,0,0,0,0,0,0]
["JultoSep13HighlandSubstantial","Highland","Substantial","JultoSep13",0.5,0,0,0,0.5,1,0,0,0,0,0,0]
["JultoSep13HighlandModerate","Highland","Moderate","JultoSep13",0.5,0,0.5,0,0,1,0,0,0,0,0,0]
["JultoSep13HighlandLow or No Risk","Highland","Low or No Risk","JultoSep13",0,0,0,0,0,0,0,0,0,0,0,0]
["JultoSep13HighlandNot available","Highland","Not available","JultoSep13",0.11,0.2,0.17,0.09,0.43,1,0,0,0,0,0,0]
["JultoSep13HighlandTotals","Highland","Totals","JultoSep13",0.12,0.2,0.17,0.09,0.43,1,0,0,0,0,0,0]
["JultoSep13InverclydeCritical","Inverclyde","Critical","JultoSep13",0.17,0.33,0.17,0.17,0.17,1,0.35,0.48,0.17,0,0,1]
["JultoSep13InverclydeSubstantial","Inverclyde","Substantial","JultoSep13",0.46,0.31,0.08,0.08,0.08,1,0.36,0.39,0.21,0,0.04,1]
["JultoSep13InverclydeModerate","Inverclyde","Moderate","JultoSep13",7.0000000000000007E-2,7.0000000000000007E-2,7.0000000000000007E-2,0.36,0.43,1,0.25,0.4,0.3,0,0.05,1]
["JultoSep13InverclydeLow or No Risk","Inverclyde","Low or No Risk","JultoSep13",0.14000000000000001,0.14000000000000001,0.43,0.28999999999999998,0,1,0,0,1,0,0,1]
["JultoSep13InverclydeNot available","Inverclyde","Not available","JultoSep13",0.13,0.13,0.13,0.5,0.13,1,0,0,0,0,0,0]
["JultoSep13InverclydeTotals","Inverclyde","Totals","JultoSep13",0.21,0.19,0.15,0.27,0.19,1,0.32,0.42,0.24,0,0.03,1]
["JultoSep13MidlothianCritical","Midlothian","Critical","JultoSep13",0,0,0,0,0,0,0,0,0,0,0,0]
["JultoSep13MidlothianSubstantial","Midlothian","Substantial","JultoSep13",0,0,0,0,0,0,0,0,0,0,0,0]
["JultoSep13MidlothianModerate","Midlothian","Moderate","JultoSep13",0,0,0,0,0,0,0,0,0,0,0,0]
["JultoSep13MidlothianLow or No Risk","Midlothian","Low or No Risk","JultoSep13",0,0,0,0,0,0,0,0,0,0,0,0]
["JultoSep13MidlothianNot available","Midlothian","Not available","JultoSep13",0,0,0,0,0,0,0,0,0,0,0,0]
["JultoSep13MidlothianTotals","Midlothian","Totals","JultoSep13",0,0,0,0,0,0,0,0,0,0,0,0]
["JultoSep13MorayCritical","Moray","Critical","JultoSep13",0,0.14000000000000001,0.14000000000000001,0.14000000000000001,0.56999999999999995,1,0.6,0.4,0,0,0,1]
["JultoSep13MoraySubstantial","Moray","Substantial","JultoSep13",0.09,0.28000000000000003,0.24,0.11,0.28000000000000003,1,0.33,0.61,0.05,0.01,0,1]
["JultoSep13MorayModerate","Moray","Moderate","JultoSep13",0,0.13,0.38,0.13,0.38,1,0.17,0.67,0,0.17,0,1]
["JultoSep13MorayLow or No Risk","Moray","Low or No Risk","JultoSep13",0,0,0,0,0,0,0,0,0,0,0,0]
["JultoSep13MorayNot available","Moray","Not available","JultoSep13",0,0.2,0.2,0,0.6,1,0.33,0.67,0,0,0,1]
["JultoSep13MorayTotals","Moray","Totals","JultoSep13",7.0000000000000007E-2,0.25,0.24,0.11,0.32,1,0.35,0.59,0.04,0.02,0,1]
["JultoSep13North AyrshireCritical","North Ayrshire","Critical","JultoSep13",0,0.77,0.23,0,0,1,0.37,0.37,0.21,0.05,0,1]
["JultoSep13North AyrshireSubstantial","North Ayrshire","Substantial","JultoSep13",0.03,0.43,0.13,0.05,0.38,1,0.63,0.34,0.03,0,0,1]
["JultoSep13North AyrshireModerate","North Ayrshire","Moderate","JultoSep13",0,0,0.2,0.3,0.5,1,0.8,0.2,0,0,0,1]
["JultoSep13North AyrshireLow or No Risk","North Ayrshire","Low or No Risk","JultoSep13",0,0.33,0.11,0.11,0.44,1,1,0,0,0,0,1]
["JultoSep13North AyrshireNot available","North Ayrshire","Not available","JultoSep13",0,0,0,0,1,1,1,0,0,0,0,1]
["JultoSep13North AyrshireTotals","North Ayrshire","Totals","JultoSep13",0.01,0.41,0.15,0.08,0.34,1,0.59,0.33,7.0000000000000007E-2,0.01,0,1]
["JultoSep13North LanarkshireCritical","North Lanarkshire","Critical","JultoSep13",0.7,0.17,7.0000000000000007E-2,0.02,0.04,1,0.26,0.71,0.01,0.01,0,1]
["JultoSep13North LanarkshireSubstantial","North Lanarkshire","Substantial","JultoSep13",0.46,0.28000000000000003,0.1,0.05,0.11,1,0.4,0.48,0.04,0.04,0.04,1]
["JultoSep13North LanarkshireModerate","North Lanarkshire","Moderate","JultoSep13",0.54,0.25,0.11,0.01,0.09,1,0.48,0.45,0,0.05,0.02,1]
["JultoSep13North LanarkshireLow or No Risk","North Lanarkshire","Low or No Risk","JultoSep13",0.61,0.19,0.13,0.04,0.04,1,0.47,0.53,0,0,0,1]
["JultoSep13North LanarkshireNot available","North Lanarkshire","Not available","JultoSep13",0,0,0,0,0,0,0,0,0,0,0,0]
["JultoSep13North LanarkshireTotals","North Lanarkshire","Totals","JultoSep13",0.6,0.21,0.09,0.03,7.0000000000000007E-2,1,0.34,0.61,0.01,0.02,0.01,1]
["JultoSep13Orkney islandsCritical","Orkney islands","Critical","JultoSep13",0,0,0,0,0,0,0,0,0,0,0,0]
["JultoSep13Orkney islandsSubstantial","Orkney islands","Substantial","JultoSep13",0,0,0,0,0,0,0,0,0,0,0,0]
["JultoSep13Orkney islandsModerate","Orkney islands","Moderate","JultoSep13",0,0,0,0,0,0,0,0,0,0,0,0]
["JultoSep13Orkney islandsLow or No Risk","Orkney islands","Low or No Risk","JultoSep13",0,0,0,0,0,0,0,0,0,0,0,0]
["JultoSep13Orkney islandsNot available","Orkney islands","Not available","JultoSep13",0,0,0,0,0,0,0,0,0,0,0,0]
["JultoSep13Orkney islandsTotals","Orkney islands","Totals","JultoSep13",0,0,0,0,0,0,0,0,0,0,0,0]
["JultoSep13Perth & KinrossCritical","Perth & Kinross","Critical","JultoSep13",0.75,0.13,0,0,0.13,1,0,0.8,0,0,0.2,1]
[{"$f":"D2122&B2122&C2122","v":"JultoSep13Perth & KinrossSubstantial"},"Perth & Kinross","Substantial","JultoSep13",0.3,0.34,0.09,0.16,0.11,1,0,0.47,0.33,0,0.2,1]
["JultoSep13Perth & KinrossModerate","Perth & Kinross","Moderate","JultoSep13",0.37,0.24,0.19,0.08,0.12,1,0,0.79,0.02,0.09,0.09,1]
["JultoSep13Perth & KinrossLow or No Risk","Perth & Kinross","Low or No Risk","JultoSep13",0.33,0.11,0.11,0.22,0.22,1,0,0,0,1,0,1]
["JultoSep13Perth & KinrossNot available","Perth & Kinross","Not available","JultoSep13",0.27,0.27,0.25,0,0.21,1,0,0.56999999999999995,0,0,0.43,1]
["JultoSep13Perth & KinrossTotals","Perth & Kinross","Totals","JultoSep13",0.34,0.26,0.17,0.09,0.14000000000000001,1,0,0.69,0.08,7.0000000000000007E-2,0.15,1]
["JultoSep13RenfrewshireCritical","Renfrewshire","Critical","JultoSep13",0.67,0.25,0,0.04,0.04,1,0.33,0.51,0.11,0.05,0,1]
["JultoSep13RenfrewshireSubstantial","Renfrewshire","Substantial","JultoSep13",0.76,0.15,0.02,0.02,0.04,1,0.4,0.33,0.16,0.05,0.05,1]
["JultoSep13RenfrewshireModerate","Renfrewshire","Moderate","JultoSep13",0.89,0,0.11,0,0,1,0.33,0.51,0.11,0.05,0,1]
["JultoSep13RenfrewshireLow or No Risk","Renfrewshire","Low or No Risk","JultoSep13",0.86,0,0,0,0.14000000000000001,1,0.83,0,0,0.17,0,1]
["JultoSep13RenfrewshireNot available","Renfrewshire","Not available","JultoSep13",0.5,0.18,0.05,0.02,0.25,1,0.71,0.2,0.04,0.02,0.03,1]
["JultoSep13RenfrewshireTotals","Renfrewshire","Totals","JultoSep13",0.57999999999999996,0.17,0.04,0.02,0.19,1,0.54,0.31,0.08,0.04,0.02,1]
["JultoSep13Scottish BordersCritical","Scottish Borders","Critical","JultoSep13",0.19,0.26,0.2,0.08,0.27,1,0.11,0.63,0.13,0.09,0.04,1]
["JultoSep13Scottish BordersSubstantial","Scottish Borders","Substantial","JultoSep13",0.03,0.17,0.11,0.14000000000000001,0.56000000000000005,1,0,0.5,0.25,0,0.25,1]
["JultoSep13Scottish BordersModerate","Scottish Borders","Moderate","JultoSep13",0,0,0,0.5,0.5,1,0,0,0,0,0,0]
["JultoSep13Scottish BordersLow or No Risk","Scottish Borders","Low or No Risk","JultoSep13",0,0.25,0.25,0,0.5,1,0,0,0,0,0,0]
["JultoSep13Scottish BordersNot available","Scottish Borders","Not available","JultoSep13",0,0,0,0,0,0,0,0,0,0,0,0]
["JultoSep13Scottish BordersTotals","Scottish Borders","Totals","JultoSep13",0.16,0.25,0.18,0.09,0.32,1,0.1,0.62,0.14000000000000001,0.08,0.06,1]
["JultoSep13Shetland islandsCritical","Shetland islands","Critical","JultoSep13",0,0.25,0.42,0.17,0.17,1,0.4,0.6,0,0,0,1]
["JultoSep13Shetland islandsSubstantial","Shetland islands","Substantial","JultoSep13",0,0,0.17,0.33,0.5,1,0.4,0.6,0,0,0,1]
["JultoSep13Shetland islandsModerate","Shetland islands","Moderate","JultoSep13",0,1,0,0,0,1,0,1,0,0,0,1]
["JultoSep13Shetland islandsLow or No Risk","Shetland islands","Low or No Risk","JultoSep13",0,0,0,0,0,0,0,0,0,0,0,0]
["JultoSep13Shetland islandsNot available","Shetland islands","Not available","JultoSep13",0.03,0.28000000000000003,0.31,0.03,0.34,1,0,1,0,0,0,1]
["JultoSep13Shetland islandsTotals","Shetland islands","Totals","JultoSep13",0.02,0.25,0.31,0.1,0.31,1,0.28999999999999998,0.71,0,0,0,1]
["JultoSep13South AyrshireCritical","South Ayrshire","Critical","JultoSep13",0,0,0,0,0,0,0,0,0,0,0,0]
["JultoSep13South AyrshireSubstantial","South Ayrshire","Substantial","JultoSep13",0,0,0,0,0,0,0,0,0,0,0,0]
["JultoSep13South AyrshireModerate","South Ayrshire","Moderate","JultoSep13",0,0,0,0,0,0,0,0,0,0,0,0]
["JultoSep13South AyrshireLow or No Risk","South Ayrshire","Low or No Risk","JultoSep13",0,0,0,0,0,0,0,0,0,0,0,0]
["JultoSep13South AyrshireNot available","South Ayrshire","Not available","JultoSep13",0,0,0,0,0,0,0,0,0,0,0,0]
["JultoSep13South AyrshireTotals","South Ayrshire","Totals","JultoSep13",0,0,0,0,0,0,0,0,0,0,0,0]
["JultoSep13South LanarkshireCritical","South Lanarkshire","Critical","JultoSep13",0,0,0,0,0,0,0,0,0,0,0,0]
["JultoSep13South LanarkshireSubstantial","South Lanarkshire","Substantial","JultoSep13",0,0,0,0,0,0,0,0,0,0,0,0]
["JultoSep13South LanarkshireModerate","South Lanarkshire","Moderate","JultoSep13",0,0,0,0,0,0,0,0,0,0,0,0]
["JultoSep13South LanarkshireLow or No Risk","South Lanarkshire","Low or No Risk","JultoSep13",0,0,0,0,0,0,0,0,0,0,0,0]
["JultoSep13South LanarkshireNot available","South Lanarkshire","Not available","JultoSep13",0,0,0,0,0,0,0,0,0,0,0,0]
["JultoSep13South LanarkshireTotals","South Lanarkshire","Totals","JultoSep13",0,0,0,0,0,0,0,0,0,0,0,0]
["JultoSep13StirlingCritical","Stirling","Critical","JultoSep13",0.79,0.11,0.03,0.01,0.06,1,0.05,0.82,0.1,0.03,0,1]
["JultoSep13StirlingSubstantial","Stirling","Substantial","JultoSep13",0.59,0.22,0.05,0,0.14000000000000001,1,0,0.86,0.14000000000000001,0,0,1]
["JultoSep13StirlingModerate","Stirling","Moderate","JultoSep13",0.28999999999999998,0.12,0,0,0.59,1,0,0,0,0,0,0]
["JultoSep13StirlingLow or No Risk","Stirling","Low or No Risk","JultoSep13",0,0,0,0,0,0,0,0,0,0,0,0]
["JultoSep13StirlingNot available","Stirling","Not available","JultoSep13",0.28999999999999998,0.22,0.06,0.08,0.35,1,7.0000000000000007E-2,0.67,0.27,0,0,1]
["JultoSep13StirlingTotals","Stirling","Totals","JultoSep13",0.56000000000000005,0.18,0.04,0.02,0.2,1,0.04,0.79,0.15,0.01,0,1]
["JultoSep13West DunbartonshireCritical","West Dunbartonshire","Critical","JultoSep13",0.32,0.46,0.18,0.04,0,1,1,0,0,0,0,1]
["JultoSep13West DunbartonshireSubstantial","West Dunbartonshire","Substantial","JultoSep13",0.54,0.28000000000000003,0.13,0.04,0.02,1,0.77,0.23,0,0,0,1]
["JultoSep13West DunbartonshireModerate","West Dunbartonshire","Moderate","JultoSep13",0.53,0.16,0.16,0.06,0.09,1,0.45,0.33,0.21,0,0,1]
["JultoSep13West DunbartonshireLow or No Risk","West Dunbartonshire","Low or No Risk","JultoSep13",0.4,0.2,0.26,0.04,0.1,1,0.38,0.54,0.08,0,0,1]
["JultoSep13West DunbartonshireNot available","West Dunbartonshire","Not available","JultoSep13",0,0,0,0,0,0,0,0,0,0,0,0]
["JultoSep13West DunbartonshireTotals","West Dunbartonshire","Totals","JultoSep13",0.48,0.24,0.18,0.05,0.06,1,0.69,0.25,0.06,0,0,1]
["JultoSep13West LothianCritical","West Lothian","Critical","JultoSep13",0.4,0.21,0.17,0.13,0.1,1,0.16,0.59,0.08,0.14000000000000001,0.03,1]
["JultoSep13West LothianSubstantial","West Lothian","Substantial","JultoSep13",0.4,0.4,7.0000000000000007E-2,0.02,0.11,1,0.28999999999999998,0.46,0.17,0.04,0.04,1]
["JultoSep13West LothianModerate","West Lothian","Moderate","JultoSep13",0.27,0.45,0.09,0.09,0.09,1,0.22,0.56000000000000005,0.11,0.11,0,1]
["JultoSep13West LothianLow or No Risk","West Lothian","Low or No Risk","JultoSep13",1,0,0,0,0,1,0,1,0,0,0,1]
["JultoSep13West LothianNot available","West Lothian","Not available","JultoSep13",0.75,0,0.25,0,0,1,0,0,0,0,0,0]
["JultoSep13West LothianTotals","West Lothian","Totals","JultoSep13",0.39,0.32,0.12,0.08,0.1,1,0.21,0.55000000000000004,0.11,0.1,0.03,1]
["JultoSep13SCOTLAND TOTALSCritical","SCOTLAND TOTALS","Critical","JultoSep13",0.4,0.28000000000000003,0.12,0.05,0.15,1,0.28000000000000003,0.59,7.0000000000000007E-2,0.04,0.03,1]
["JultoSep13SCOTLAND TOTALSSubstantial","SCOTLAND TOTALS","Substantial","JultoSep13",0.24,0.23,0.15,0.09,0.28999999999999998,1,0.23,0.57999999999999996,0.11,0.04,0.04,1]
["JultoSep13SCOTLAND TOTALSModerate","SCOTLAND TOTALS","Moderate","JultoSep13",0.25,0.22,0.11,0.08,0.35,1,0.25,0.62,7.0000000000000007E-2,0.04,0.02,1]
["JultoSep13SCOTLAND TOTALSLow or No Risk","SCOTLAND TOTALS","Low or No Risk","JultoSep13",0.33,0.14000000000000001,0.13,0.06,0.34,1,0.27,0.68,0.02,0.03,0,1]
["JultoSep13SCOTLAND TOTALSNot available","SCOTLAND TOTALS","Not available","JultoSep13",0.2,0.28999999999999998,0.14000000000000001,0.11,0.26,1,0.19,0.65,0.09,0.04,0.03,1]
["JultoSep13SCOTLAND TOTALSTotals","SCOTLAND TOTALS","Totals","JultoSep13",0.26,0.25,0.13,0.09,0.27,1,0.23,0.62,0.09,0.04,0.03,1]
["OcttoDec13Aberdeen CityCritical","Aberdeen City","Critical","OcttoDec13",0,0,0,0,0,0,0,0,0,0,0,0]
["OcttoDec13Aberdeen CitySubstantial","Aberdeen City","Substantial","OcttoDec13",0.19,0.31,0.25,0.16,0.09,1,0.23,0.46,0.31,0,0,1]
["OcttoDec13Aberdeen CityModerate","Aberdeen City","Moderate","OcttoDec13",0.25,0,0,0,0.75,1,0,0,0,0,0,0]
["OcttoDec13Aberdeen CityLow or No Risk","Aberdeen City","Low or No Risk","OcttoDec13",0.33,0,0,0,0.67,1,0,0,0,0,0,0]
["OcttoDec13Aberdeen CityNot available","Aberdeen City","Not available","OcttoDec13",0,0,0.33,0,0.67,1,0,0,0,0,0,0]
[{"$f":"D2186&B2186&C2186","v":"OcttoDec13Aberdeen CityTotals"},"Aberdeen City","Totals","OcttoDec13",0.2,0.22,0.2,0.11,0.27,1,0.23,0.46,0.31,0,0,1]
["OcttoDec13AberdeenshireCritical","Aberdeenshire","Critical","OcttoDec13",0.17,0.33,0.33,0.17,0,1,0,0,0,0,0,0]
["OcttoDec13AberdeenshireSubstantial","Aberdeenshire","Substantial","OcttoDec13",0,0.57999999999999996,0.08,0.17,0.17,1,0,0,0,0,0,0]
["OcttoDec13AberdeenshireModerate","Aberdeenshire","Moderate","OcttoDec13",0,0.47,0.2,0.13,0.2,1,0,0,0,0,0,0]
["OcttoDec13AberdeenshireLow or No Risk","Aberdeenshire","Low or No Risk","OcttoDec13",0.14000000000000001,0.28999999999999998,0.28999999999999998,0,0.28999999999999998,1,0,0,0,0,0,0]
["OcttoDec13AberdeenshireNot available","Aberdeenshire","Not available","OcttoDec13",0.11,0.31,0.19,0.12,0.27,1,0,0,0,0,0,0]
["OcttoDec13AberdeenshireTotals","Aberdeenshire","Totals","OcttoDec13",0.1,0.33,0.19,0.12,0.25,1,0,0,0,0,0,0]
["OcttoDec13AngusCritical","Angus","Critical","OcttoDec13",0.16,0.21,0.21,0.11,0.32,1,0.67,0.11,0,0.22,0,1]
["OcttoDec13AngusSubstantial","Angus","Substantial","OcttoDec13",0.68,0.18,0.05,0.05,0.05,1,0.38,0.51,7.0000000000000007E-2,0.04,0,1]
["OcttoDec13AngusModerate","Angus","Moderate","OcttoDec13",0.9,0.05,0.03,0,0.03,1,0.18,0.82,0,0,0,1]
["OcttoDec13AngusLow or No Risk","Angus","Low or No Risk","OcttoDec13",1,0,0,0,0,1,0.05,0.95,0,0,0,1]
["OcttoDec13AngusNot available","Angus","Not available","OcttoDec13",0,0,0,0,0,0,0.89,0.11,0,0,0,1]
["OcttoDec13AngusTotals","Angus","Totals","OcttoDec13",0.81,7.0000000000000007E-2,0.04,0.02,0.05,1,0.24,0.72,0.02,0.02,0,1]
["OcttoDec13Argyll & ButeCritical","Argyll & Bute","Critical","OcttoDec13",0.5,0.32,0.04,0.06,0.08,1,0.39,0.37,0.08,0.03,0.13,1]
["OcttoDec13Argyll & ButeSubstantial","Argyll & Bute","Substantial","OcttoDec13",0.3,0.27,0.19,0.09,0.15,1,0.43,0.24,7.0000000000000007E-2,0.11,0.14000000000000001,1]
["OcttoDec13Argyll & ButeModerate","Argyll & Bute","Moderate","OcttoDec13",0.49,0.22,0.01,0.09,0.19,1,0,0,0,0,1,1]
["OcttoDec13Argyll & ButeLow or No Risk","Argyll & Bute","Low or No Risk","OcttoDec13",0.2,0.4,0,0.2,0.2,1,0,0,0,0,0,0]
["OcttoDec13Argyll & ButeNot available","Argyll & Bute","Not available","OcttoDec13",0,0,0,0,0,0,0,0,0,0,0,0]
["OcttoDec13Argyll & ButeTotals","Argyll & Bute","Totals","OcttoDec13",0.4,0.28000000000000003,0.11,0.08,0.14000000000000001,1,0.41,0.28000000000000003,7.0000000000000007E-2,0.08,0.15,1]
["OcttoDec13ClackmannanshireCritical","Clackmannanshire","Critical","OcttoDec13",0,0,0,0,0,0,0,0,0,0,0,0]
["OcttoDec13ClackmannanshireSubstantial","Clackmannanshire","Substantial","OcttoDec13",0.12,0.41,0,0,0.47,1,0,0,0,0,0,0]
["OcttoDec13ClackmannanshireModerate","Clackmannanshire","Moderate","OcttoDec13",0.03,0.03,0.14000000000000001,0.14000000000000001,0.66,1,0,0,0,0,0,0]
["OcttoDec13ClackmannanshireLow or No Risk","Clackmannanshire","Low or No Risk","OcttoDec13",0,0.02,0.09,0.12,0.77,1,0,0,0,0,0,0]
["OcttoDec13ClackmannanshireNot available","Clackmannanshire","Not available","OcttoDec13",0,0,0,0,0,0,0.82,0.12,0.01,0.05,0,1]
["OcttoDec13ClackmannanshireTotals","Clackmannanshire","Totals","OcttoDec13",0.03,0.1,0.09,0.1,0.67,1,0.82,0.12,0.01,0.05,0,1]
["OcttoDec13Dumfries and GallowayCritical","Dumfries and Galloway","Critical","OcttoDec13",0,0,0,0,0,0,0,0,0,0,0,0]
["OcttoDec13Dumfries and GallowaySubstantial","Dumfries and Galloway","Substantial","OcttoDec13",0,0,0,0,0,0,0,0,0,0,0,0]
["OcttoDec13Dumfries and GallowayModerate","Dumfries and Galloway","Moderate","OcttoDec13",0,0,0,0,0,0,0,0,0,0,0,0]
["OcttoDec13Dumfries and GallowayLow or No Risk","Dumfries and Galloway","Low or No Risk","OcttoDec13",0,0,0,0,0,0,0,0,0,0,0,0]
["OcttoDec13Dumfries and GallowayNot available","Dumfries and Galloway","Not available","OcttoDec13",0.34,0.43,7.0000000000000007E-2,0.06,0.1,1,0.05,0.56999999999999995,0.21,0.09,0.08,1]
["OcttoDec13Dumfries and GallowayTotals","Dumfries and Galloway","Totals","OcttoDec13",0.34,0.43,7.0000000000000007E-2,0.06,0.1,1,0.05,0.56999999999999995,0.21,0.09,0.08,1]
["OcttoDec13Dundee CityCritical","Dundee City","Critical","OcttoDec13",0.24,0.47,0.24,0,0.06,1,0,0,0,0,1,1]
["OcttoDec13Dundee CitySubstantial","Dundee City","Substantial","OcttoDec13",0.21,0.14000000000000001,0.21,7.0000000000000007E-2,0.38,1,0,0,0,0,0,0]
["OcttoDec13Dundee CityModerate","Dundee City","Moderate","OcttoDec13",0.12,0.41,0.16,0.1,0.21,1,0,0,0,0,0,0]
["OcttoDec13Dundee CityLow or No Risk","Dundee City","Low or No Risk","OcttoDec13",0.1,0.12,0.1,0.2,0.49,1,0,0,0,0,0,0]
["OcttoDec13Dundee CityNot available","Dundee City","Not available","OcttoDec13",0,0.5,0,0,0.5,1,0,0,0,0,0,0]
["OcttoDec13Dundee CityTotals","Dundee City","Totals","OcttoDec13",0.14000000000000001,0.35,0.16,0.1,0.25,1,0,0,0,0,1,1]
["OcttoDec13East AyrshireCritical","East Ayrshire","Critical","OcttoDec13",0.64,0.36,0,0,0,1,0.51,0.49,0,0,0,1]
["OcttoDec13East AyrshireSubstantial","East Ayrshire","Substantial","OcttoDec13",0.51,0.42,7.0000000000000007E-2,0,0,1,0.55000000000000004,0.45,0,0,0,1]
["OcttoDec13East AyrshireModerate","East Ayrshire","Moderate","OcttoDec13",0.51,0.39,0.03,0.06,0.01,1,0.12,0.5,0.23,0.15,0,1]
["OcttoDec13East AyrshireLow or No Risk","East Ayrshire","Low or No Risk","OcttoDec13",0.67,0.17,0.17,0,0,1,0,0,0,0,0,0]
["OcttoDec13East AyrshireNot available","East Ayrshire","Not available","OcttoDec13",0,0,0,0,0,0,0,0,0,0,0,0]
["OcttoDec13East AyrshireTotals","East Ayrshire","Totals","OcttoDec13",0.57999999999999996,0.37,0.02,0.02,0,1,0.46,0.48,0.03,0.02,0,1]
["OcttoDec13East DunbartonshireCritical","East Dunbartonshire","Critical","OcttoDec13",0.21,0.71,7.0000000000000007E-2,0,0,1,0,1,0,0,0,1]
["OcttoDec13East DunbartonshireSubstantial","East Dunbartonshire","Substantial","OcttoDec13",0.2,0.28999999999999998,0.25,7.0000000000000007E-2,0.19,1,0,0.96,0.04,0,0,1]
["OcttoDec13East DunbartonshireModerate","East Dunbartonshire","Moderate","OcttoDec13",0.08,0.12,0.08,0.12,0.62,1,0,1,0,0,0,1]
["OcttoDec13East DunbartonshireLow or No Risk","East Dunbartonshire","Low or No Risk","OcttoDec13",0,0.5,0,0,0.5,1,0,1,0,0,0,1]
["OcttoDec13East DunbartonshireNot available","East Dunbartonshire","Not available","OcttoDec13",0,1,0,0,0,1,0,0,0,0,0,0]
["OcttoDec13East DunbartonshireTotals","East Dunbartonshire","Totals","OcttoDec13",0.17,0.31,0.19,7.0000000000000007E-2,0.25,1,0,0.97,0.03,0,0,1]
["OcttoDec13East LothianCritical","East Lothian","Critical","OcttoDec13",0,0,0,0,0,0,0,0,0,0,0,0]
["OcttoDec13East LothianSubstantial","East Lothian","Substantial","OcttoDec13",0.26,0.22,0.2,0.1,0.21,1,0.19,0.42,0.27,0.09,0.02,1]
["OcttoDec13East LothianModerate","East Lothian","Moderate","OcttoDec13",0,0,0,0,0,0,0,0,0,0,0,0]
["OcttoDec13East LothianLow or No Risk","East Lothian","Low or No Risk","OcttoDec13",0,0,0,0,0,0,0,0,0,0,0,0]
["OcttoDec13East LothianNot available","East Lothian","Not available","OcttoDec13",0,0,0,0,0,0,0,0,0,0,0,0]
["OcttoDec13East LothianTotals","East Lothian","Totals","OcttoDec13",0.26,0.22,0.2,0.1,0.21,1,0.19,0.42,0.27,0.09,0.02,1]
["OcttoDec13East RenfrewshireCritical","East Renfrewshire","Critical","OcttoDec13",0,0,0,0,0,0,0,0,0,0,0,0]
["OcttoDec13East RenfrewshireSubstantial","East Renfrewshire","Substantial","OcttoDec13",0,0,0,0,0,0,0,0,0,0,0,0]
["OcttoDec13East RenfrewshireModerate","East Renfrewshire","Moderate","OcttoDec13",0,0,0,0,0,0,0,0,0,0,0,0]
["OcttoDec13East RenfrewshireLow or No Risk","East Renfrewshire","Low or No Risk","OcttoDec13",0,0,0,0,0,0,0,0,0,0,0,0]
["OcttoDec13East RenfrewshireNot available","East Renfrewshire","Not available","OcttoDec13",0,0,0,0,0,0,0,0,0,0,0,0]
["OcttoDec13East RenfrewshireTotals","East Renfrewshire","Totals","OcttoDec13",0,0,0,0,0,0,0,0,0,0,0,0]
["OcttoDec13Edinburgh, City ofCritical","Edinburgh, City of","Critical","OcttoDec13",0,0,0,0,0,0,0,0,0,0,0,0]
["OcttoDec13Edinburgh, City ofSubstantial","Edinburgh, City of","Substantial","OcttoDec13",0,0,0,0,0,0,0,0,0,0,0,0]
["OcttoDec13Edinburgh, City ofModerate","Edinburgh, City of","Moderate","OcttoDec13",0,0,0,0,0,0,0,0,0,0,0,0]
[{"$f":"D2250&B2250&C2250","v":"OcttoDec13Edinburgh, City ofLow or No Risk"},"Edinburgh, City of","Low or No Risk","OcttoDec13",0,0,0,0,0,0,0,0,0,0,0,0]
["OcttoDec13Edinburgh, City ofNot available","Edinburgh, City of","Not available","OcttoDec13",0.19,0.2,0.16,0.15,0.3,1,0.02,0.66,0.17,0.11,0.04,1]
["OcttoDec13Edinburgh, City ofTotals","Edinburgh, City of","Totals","OcttoDec13",0.19,0.2,0.16,0.15,0.3,1,0.02,0.66,0.17,0.11,0.04,1]
["OcttoDec13Eilean SiarCritical","Eilean Siar","Critical","OcttoDec13",0,0,0,0,0,0,0,0,0,0,0,0]
["OcttoDec13Eilean SiarSubstantial","Eilean Siar","Substantial","OcttoDec13",0,0,0,0,0,0,0,0,0,0,0,0]
["OcttoDec13Eilean SiarModerate","Eilean Siar","Moderate","OcttoDec13",0,0,0,0,0,0,0,0,0,0,0,0]
["OcttoDec13Eilean SiarLow or No Risk","Eilean Siar","Low or No Risk","OcttoDec13",0,0,0,0,0,0,0,0,0,0,0,0]
["OcttoDec13Eilean SiarNot available","Eilean Siar","Not available","OcttoDec13",0,0,0,0,0,0,0,0,0,0,0,0]
["OcttoDec13Eilean SiarTotals","Eilean Siar","Totals","OcttoDec13",0,0,0,0,0,0,0,0,0,0,0,0]
["OcttoDec13FalkirkCritical","Falkirk","Critical","OcttoDec13",0,0,0,0,0,0,0,0,0,0,0,0]
["OcttoDec13FalkirkSubstantial","Falkirk","Substantial","OcttoDec13",0,0,0,0,0,0,0,0,0,0,0,0]
["OcttoDec13FalkirkModerate","Falkirk","Moderate","OcttoDec13",0,0,0,0,0,0,0,0,0,0,0,0]
["OcttoDec13FalkirkLow or No Risk","Falkirk","Low or No Risk","OcttoDec13",0,0,0,0,0,0,0,0,0,0,0,0]
["OcttoDec13FalkirkNot available","Falkirk","Not available","OcttoDec13",0,0,0,0,0,0,0,0,0,0,0,0]
["OcttoDec13FalkirkTotals","Falkirk","Totals","OcttoDec13",0,0,0,0,0,0,0,0,0,0,0,0]
["OcttoDec13FifeCritical","Fife","Critical","OcttoDec13",0.12,0.62,0.12,0.06,7.0000000000000007E-2,1,0.09,0.43,0.34,0.13,0.02,1]
["OcttoDec13FifeSubstantial","Fife","Substantial","OcttoDec13",0.05,0.25,0.18,0.14000000000000001,0.38,1,0.22,0.35,0.25,0.12,0.06,1]
["OcttoDec13FifeModerate","Fife","Moderate","OcttoDec13",0.01,0.03,0.08,0.21,0.67,1,0.24,0.41,0.24,0.06,0.06,1]
["OcttoDec13FifeLow or No Risk","Fife","Low or No Risk","OcttoDec13",0.04,0.08,0.08,0,0.79,1,0,0.5,0,0,0.5,1]
["OcttoDec13FifeNot available","Fife","Not available","OcttoDec13",0,0,0,0,0,0,0,0,0,0,0,0]
["OcttoDec13FifeTotals","Fife","Totals","OcttoDec13",0.05,0.22,0.14000000000000001,0.15,0.45,1,0.19,0.37,0.26,0.12,0.06,1]
["OcttoDec13Glasgow CityCritical","Glasgow City","Critical","OcttoDec13",0.02,0.14000000000000001,0.17,0.05,0.63,1,0,1,0,0,0,1]
["OcttoDec13Glasgow CitySubstantial","Glasgow City","Substantial","OcttoDec13",0.06,0.11,0.12,0.08,0.64,1,0,1,0,0,0,1]
["OcttoDec13Glasgow CityModerate","Glasgow City","Moderate","OcttoDec13",0.1,0.24,0.04,0.04,0.56999999999999995,1,0,1,0,0,0,1]
["OcttoDec13Glasgow CityLow or No Risk","Glasgow City","Low or No Risk","OcttoDec13",0.1,0.28999999999999998,0.1,0.05,0.48,1,0,1,0,0,0,1]
["OcttoDec13Glasgow CityNot available","Glasgow City","Not available","OcttoDec13",0.14000000000000001,0.48,7.0000000000000007E-2,0.09,0.22,1,0,1,0,0,0,1]
["OcttoDec13Glasgow CityTotals","Glasgow City","Totals","OcttoDec13",0.09,0.26,0.09,7.0000000000000007E-2,0.5,1,0,1,0,0,0,1]
["OcttoDec13HighlandCritical","Highland","Critical","OcttoDec13",0,0,0,0,0,0,0,0,0,0,0,0]
["OcttoDec13HighlandSubstantial","Highland","Substantial","OcttoDec13",0,0,0,0,0,0,0,0,0,0,0,0]
["OcttoDec13HighlandModerate","Highland","Moderate","OcttoDec13",0,0,0,0,0,0,0,0,0,0,0,0]
["OcttoDec13HighlandLow or No Risk","Highland","Low or No Risk","OcttoDec13",0,0,0,0,0,0,0,0,0,0,0,0]
["OcttoDec13HighlandNot available","Highland","Not available","OcttoDec13",0.13,0.23,0.15,0.13,0.36,1,0,0,0,0,0,0]
["OcttoDec13HighlandTotals","Highland","Totals","OcttoDec13",0.13,0.23,0.15,0.13,0.36,1,0,0,0,0,0,0]
["OcttoDec13InverclydeCritical","Inverclyde","Critical","OcttoDec13",0,0,0,0,0,0,0,0,0,0,0,0]
["OcttoDec13InverclydeSubstantial","Inverclyde","Substantial","OcttoDec13",0,0,0,0,0,0,0,0,0,0,0,0]
["OcttoDec13InverclydeModerate","Inverclyde","Moderate","OcttoDec13",0,0,0,0,0,0,0,0,0,0,0,0]
["OcttoDec13InverclydeLow or No Risk","Inverclyde","Low or No Risk","OcttoDec13",0,0,0,0,0,0,0,0,0,0,0,0]
["OcttoDec13InverclydeNot available","Inverclyde","Not available","OcttoDec13",0,0,0,0,0,0,0,0,0,0,0,0]
["OcttoDec13InverclydeTotals","Inverclyde","Totals","OcttoDec13",0,0,0,0,0,0,0,0,0,0,0,0]
["OcttoDec13MidlothianCritical","Midlothian","Critical","OcttoDec13",0,0,0,0,0,0,0,0,0,0,0,0]
["OcttoDec13MidlothianSubstantial","Midlothian","Substantial","OcttoDec13",0,0,0,0,0,0,0,0,0,0,0,0]
["OcttoDec13MidlothianModerate","Midlothian","Moderate","OcttoDec13",0,0,0,0,0,0,0,0,0,0,0,0]
["OcttoDec13MidlothianLow or No Risk","Midlothian","Low or No Risk","OcttoDec13",0,0,0,0,0,0,0,0,0,0,0,0]
["OcttoDec13MidlothianNot available","Midlothian","Not available","OcttoDec13",0,0,0,0,0,0,0,0,0,0,0,0]
["OcttoDec13MidlothianTotals","Midlothian","Totals","OcttoDec13",0,0,0,0,0,0,0,0,0,0,0,0]
["OcttoDec13MorayCritical","Moray","Critical","OcttoDec13",0,0,0.14000000000000001,0.14000000000000001,0.71,1,0.33,0.67,0,0,0,1]
["OcttoDec13MoraySubstantial","Moray","Substantial","OcttoDec13",0.02,0.27,0.27,0.1,0.33,1,0.34,0.56999999999999995,0.06,0.04,0,1]
["OcttoDec13MorayModerate","Moray","Moderate","OcttoDec13",0,0.38,0.38,0,0.25,1,0.33,0.67,0,0,0,1]
["OcttoDec13MorayLow or No Risk","Moray","Low or No Risk","OcttoDec13",0,0,0,0,0,0,0,0,0,0,0,0]
["OcttoDec13MorayNot available","Moray","Not available","OcttoDec13",0,0.33,0,0,0.67,1,0.5,0,0.5,0,0,1]
["OcttoDec13MorayTotals","Moray","Totals","OcttoDec13",0.02,0.25,0.26,0.09,0.39,1,0.35,0.55000000000000004,7.0000000000000007E-2,0.03,0,1]
["OcttoDec13North AyrshireCritical","North Ayrshire","Critical","OcttoDec13",0.05,0.26,0.63,0.05,0,1,0.52,0.08,0.24,0.16,0,1]
["OcttoDec13North AyrshireSubstantial","North Ayrshire","Substantial","OcttoDec13",0,0.44,0.06,0.13,0.38,1,0.72,0.17,0.03,0.03,0.03,1]
["OcttoDec13North AyrshireModerate","North Ayrshire","Moderate","OcttoDec13",0,0.17,0,0.17,0.67,1,0.67,0,0.33,0,0,1]
["OcttoDec13North AyrshireLow or No Risk","North Ayrshire","Low or No Risk","OcttoDec13",0,0.33,0,0.33,0.33,1,0.67,0.33,0,0,0,1]
["OcttoDec13North AyrshireNot available","North Ayrshire","Not available","OcttoDec13",0,0,0,0,1,1,1,0,0,0,0,1]
["OcttoDec13North AyrshireTotals","North Ayrshire","Totals","OcttoDec13",0.02,0.31,0.27,0.13,0.27,1,0.65,0.13,0.13,0.08,0.02,1]
["OcttoDec13North LanarkshireCritical","North Lanarkshire","Critical","OcttoDec13",0.67,0.24,0.03,0.02,0.05,1,0.21,0.75,0.03,0.01,0,1]
["OcttoDec13North LanarkshireSubstantial","North Lanarkshire","Substantial","OcttoDec13",0.5,0.32,0.09,0.03,0.05,1,0.35,0.6,0.03,0.02,0,1]
["OcttoDec13North LanarkshireModerate","North Lanarkshire","Moderate","OcttoDec13",0.5,0.19,0.15,0.03,0.12,1,0.36,0.6,0,0.02,0.02,1]
["OcttoDec13North LanarkshireLow or No Risk","North Lanarkshire","Low or No Risk","OcttoDec13",0.52,0.23,0.1,0.04,0.1,1,0.25,0.57999999999999996,0,0.17,0,1]
["OcttoDec13North LanarkshireNot available","North Lanarkshire","Not available","OcttoDec13",0,0,0,0,0,0,1,0,0,0,0,1]
["OcttoDec13North LanarkshireTotals","North Lanarkshire","Totals","OcttoDec13",0.57999999999999996,0.24,0.08,0.03,7.0000000000000007E-2,1,0.27,0.68,0.03,0.02,0,1]
["OcttoDec13Orkney islandsCritical","Orkney islands","Critical","OcttoDec13",0,0,0,0,0,0,0,0,0,0,0,0]
[{"$f":"D2314&B2314&C2314","v":"OcttoDec13Orkney islandsSubstantial"},"Orkney islands","Substantial","OcttoDec13",0,0,0,0,0,0,0,0,0,0,0,0]
["OcttoDec13Orkney islandsModerate","Orkney islands","Moderate","OcttoDec13",0,0,0,0,0,0,0,0,0,0,0,0]
["OcttoDec13Orkney islandsLow or No Risk","Orkney islands","Low or No Risk","OcttoDec13",0,0,0,0,0,0,0,0,0,0,0,0]
["OcttoDec13Orkney islandsNot available","Orkney islands","Not available","OcttoDec13",0,0,0,0,0,0,0,0,0,0,0,0]
["OcttoDec13Orkney islandsTotals","Orkney islands","Totals","OcttoDec13",0,0,0,0,0,0,0,0,0,0,0,0]
["OcttoDec13Perth & KinrossCritical","Perth & Kinross","Critical","OcttoDec13",0,0,0,0,0,0,0,0,0,0,0,0]
["OcttoDec13Perth & KinrossSubstantial","Perth & Kinross","Substantial","OcttoDec13",0,0,0,0,0,0,0,0,0,0,0,0]
["OcttoDec13Perth & KinrossModerate","Perth & Kinross","Moderate","OcttoDec13",0,0,0,0,0,0,0,0,0,0,0,0]
["OcttoDec13Perth & KinrossLow or No Risk","Perth & Kinross","Low or No Risk","OcttoDec13",0,0,0,0,0,0,0,0,0,0,0,0]
["OcttoDec13Perth & KinrossNot available","Perth & Kinross","Not available","OcttoDec13",0,0,0,0,0,0,0,0,0,0,0,0]
["OcttoDec13Perth & KinrossTotals","Perth & Kinross","Totals","OcttoDec13",0,0,0,0,0,0,0,0,0,0,0,0]
["OcttoDec13RenfrewshireCritical","Renfrewshire","Critical","OcttoDec13",0.83,0.13,0.04,0,0,1,0.26,0.54,0.1,0.06,0.04,1]
["OcttoDec13RenfrewshireSubstantial","Renfrewshire","Substantial","OcttoDec13",0.67,0.19,0.12,0.02,0,1,0.27,0.46,0.23,0.04,0,1]
["OcttoDec13RenfrewshireModerate","Renfrewshire","Moderate","OcttoDec13",0.64,0.18,0,0,0.18,1,0.63,0.25,0.13,0,0,1]
["OcttoDec13RenfrewshireLow or No Risk","Renfrewshire","Low or No Risk","OcttoDec13",0.93,7.0000000000000007E-2,0,0,0,1,0.79,0.16,0.05,0,0,1]
["OcttoDec13RenfrewshireNot available","Renfrewshire","Not available","OcttoDec13",0.46,0.16,0.06,0.01,0.28999999999999998,1,0.56999999999999995,0.26,0.06,0.05,7.0000000000000007E-2,1]
["OcttoDec13RenfrewshireTotals","Renfrewshire","Totals","OcttoDec13",0.55000000000000004,0.16,0.06,0.01,0.21,1,0.5,0.32,0.09,0.04,0.05,1]
["OcttoDec13Scottish BordersCritical","Scottish Borders","Critical","OcttoDec13",0.27,0.24,0.14000000000000001,0.05,0.3,1,0.04,0.63,0.14000000000000001,0.14000000000000001,0.04,1]
["OcttoDec13Scottish BordersSubstantial","Scottish Borders","Substantial","OcttoDec13",0.12,0.15,0.2,0.08,0.44,1,0,1,0,0,0,1]
["OcttoDec13Scottish BordersModerate","Scottish Borders","Moderate","OcttoDec13",0,0.33,0,0.33,0.33,1,0,0,0,0,0,0]
["OcttoDec13Scottish BordersLow or No Risk","Scottish Borders","Low or No Risk","OcttoDec13",0,0.4,0,0.4,0.2,1,0,0,0,0,0,0]
["OcttoDec13Scottish BordersNot available","Scottish Borders","Not available","OcttoDec13",0,0,0,0,0,0,0,0,0,0,0,0]
["OcttoDec13Scottish BordersTotals","Scottish Borders","Totals","OcttoDec13",0.22,0.22,0.15,7.0000000000000007E-2,0.33,1,0.04,0.65,0.14000000000000001,0.14000000000000001,0.04,1]
["OcttoDec13Shetland islandsCritical","Shetland islands","Critical","OcttoDec13",0.33,0.33,0.17,0.17,0,1,0,0.8,0.2,0,0,1]
["OcttoDec13Shetland islandsSubstantial","Shetland islands","Substantial","OcttoDec13",0,0.5,0.25,0.25,0,1,0.27,0.73,0,0,0,1]
["OcttoDec13Shetland islandsModerate","Shetland islands","Moderate","OcttoDec13",0,0,0,0,1,1,0.33,0.67,0,0,0,1]
["OcttoDec13Shetland islandsLow or No Risk","Shetland islands","Low or No Risk","OcttoDec13",0,0,0,0,0,0,0,1,0,0,0,1]
["OcttoDec13Shetland islandsNot available","Shetland islands","Not available","OcttoDec13",0.09,0.32,0.05,0.32,0.23,1,0,1,0,0,0,1]
["OcttoDec13Shetland islandsTotals","Shetland islands","Totals","OcttoDec13",0.12,0.33,0.09,0.27,0.18,1,0.19,0.77,0.04,0,0,1]
["OcttoDec13South AyrshireCritical","South Ayrshire","Critical","OcttoDec13",0,0,0,0,0,0,0,0,0,0,0,0]
["OcttoDec13South AyrshireSubstantial","South Ayrshire","Substantial","OcttoDec13",0,0,0,0,0,0,0,0,0,0,0,0]
["OcttoDec13South AyrshireModerate","South Ayrshire","Moderate","OcttoDec13",0,0,0,0,0,0,0,0,0,0,0,0]
["OcttoDec13South AyrshireLow or No Risk","South Ayrshire","Low or No Risk","OcttoDec13",0,0,0,0,0,0,0,0,0,0,0,0]
["OcttoDec13South AyrshireNot available","South Ayrshire","Not available","OcttoDec13",0,0,0,0,0,0,0,0,0,0,0,0]
["OcttoDec13South AyrshireTotals","South Ayrshire","Totals","OcttoDec13",0,0,0,0,0,0,0,0,0,0,0,0]
["OcttoDec13South LanarkshireCritical","South Lanarkshire","Critical","OcttoDec13",0,0,0,0,0,0,0,0,0,0,0,0]
["OcttoDec13South LanarkshireSubstantial","South Lanarkshire","Substantial","OcttoDec13",0,0,0,0,0,0,0,0,0,0,0,0]
["OcttoDec13South LanarkshireModerate","South Lanarkshire","Moderate","OcttoDec13",0,0,0,0,0,0,0,0,0,0,0,0]
["OcttoDec13South LanarkshireLow or No Risk","South Lanarkshire","Low or No Risk","OcttoDec13",0,0,0,0,0,0,0,0,0,0,0,0]
["OcttoDec13South LanarkshireNot available","South Lanarkshire","Not available","OcttoDec13",0,0,0,0,0,0,0,0,0,0,0,0]
["OcttoDec13South LanarkshireTotals","South Lanarkshire","Totals","OcttoDec13",0,0,0,0,0,0,0,0,0,0,0,0]
["OcttoDec13StirlingCritical","Stirling","Critical","OcttoDec13",0.85,0.09,0,0.02,0.04,1,0.03,0.73,0.14000000000000001,0.11,0,1]
["OcttoDec13StirlingSubstantial","Stirling","Substantial","OcttoDec13",0.54,0.27,0.06,0,0.13,1,0,0.75,0.04,0.13,0.08,1]
["OcttoDec13StirlingModerate","Stirling","Moderate","OcttoDec13",0.44,0,0,0,0.56000000000000005,1,0,0,0,0,0,0]
["OcttoDec13StirlingLow or No Risk","Stirling","Low or No Risk","OcttoDec13",0,0,0,0,0,0,0,0,0,0,0,0]
["OcttoDec13StirlingNot available","Stirling","Not available","OcttoDec13",0.52,0.12,0,0.05,0.31,1,0.08,0.68,0.12,0.12,0,1]
["OcttoDec13StirlingTotals","Stirling","Totals","OcttoDec13",0.61,0.18,0.03,0.02,0.17,1,0.03,0.72,0.1,0.12,0.02,1]
["OcttoDec13West DunbartonshireCritical","West Dunbartonshire","Critical","OcttoDec13",0.14000000000000001,0.36,0.25,0.21,0.04,1,0.83,0.17,0,0,0,1]
["OcttoDec13West DunbartonshireSubstantial","West Dunbartonshire","Substantial","OcttoDec13",0.79,0.15,0.03,0.02,0,1,0.83,0.17,0,0,0,1]
["OcttoDec13West DunbartonshireModerate","West Dunbartonshire","Moderate","OcttoDec13",0.51,0.23,0.1,0.06,0.1,1,0.4,0.33,0.27,0,0,1]
["OcttoDec13West DunbartonshireLow or No Risk","West Dunbartonshire","Low or No Risk","OcttoDec13",0.28000000000000003,0.31,0.22,0.11,0.08,1,0.6,0.4,0,0,0,1]
["OcttoDec13West DunbartonshireNot available","West Dunbartonshire","Not available","OcttoDec13",0,0,0,0,0,0,0,0,0,0,0,0]
["OcttoDec13West DunbartonshireTotals","West Dunbartonshire","Totals","OcttoDec13",0.57999999999999996,0.22,0.1,0.06,0.04,1,0.74,0.21,0.05,0,0,1]
["OcttoDec13West LothianCritical","West Lothian","Critical","OcttoDec13",0.24,0.28999999999999998,0.24,7.0000000000000007E-2,0.15,1,0.15,0.69,0.08,0.08,0,1]
["OcttoDec13West LothianSubstantial","West Lothian","Substantial","OcttoDec13",0.28999999999999998,0.45,0.13,0.13,0,1,0.17,0.42,0.17,0.17,0.08,1]
["OcttoDec13West LothianModerate","West Lothian","Moderate","OcttoDec13",0.12,0.47,0.18,0.09,0.15,1,0.13,0.38,0.25,0.25,0,1]
["OcttoDec13West LothianLow or No Risk","West Lothian","Low or No Risk","OcttoDec13",0.33,0.33,0.11,0.22,0,1,0,1,0,0,0,1]
["OcttoDec13West LothianNot available","West Lothian","Not available","OcttoDec13",0,0.5,0,0,0.5,1,0,0,0,0,0,0]
["OcttoDec13West LothianTotals","West Lothian","Totals","OcttoDec13",0.23,0.4,0.18,0.1,0.1,1,0.15,0.53,0.15,0.15,0.03,1]
["OcttoDec13SCOTLAND TOTALSCritical","SCOTLAND TOTALS","Critical","OcttoDec13",0.42,0.28999999999999998,0.1,0.04,0.16,1,0.3,0.56000000000000005,0.08,0.05,0.02,1]
["OcttoDec13SCOTLAND TOTALSSubstantial","SCOTLAND TOTALS","Substantial","OcttoDec13",0.28000000000000003,0.23,0.14000000000000001,0.08,0.28000000000000003,1,0.23,0.6,0.1,0.05,0.03,1]
["OcttoDec13SCOTLAND TOTALSModerate","SCOTLAND TOTALS","Moderate","OcttoDec13",0.24,0.23,0.09,0.09,0.35,1,0.16,0.74,0.06,0.03,0.01,1]
["OcttoDec13SCOTLAND TOTALSLow or No Risk","SCOTLAND TOTALS","Low or No Risk","OcttoDec13",0.39,0.17,0.1,0.08,0.26,1,0.19,0.79,0.01,0.01,0.01,1]
["OcttoDec13SCOTLAND TOTALSNot available","SCOTLAND TOTALS","Not available","OcttoDec13",0.21,0.27,0.13,0.12,0.28000000000000003,1,0.16,0.62,0.11,7.0000000000000007E-2,0.03,1]
[{"$f":"D2378&B2378&C2378","v":"OcttoDec13SCOTLAND TOTALSTotals"},"SCOTLAND TOTALS","Totals","OcttoDec13",0.28000000000000003,0.25,0.12,0.09,0.27,1,0.21,0.62,0.09,0.05,0.02,1]
[{"$f":"D2379&B2379&C2379","v":"JantoMar14Aberdeen CityCritical"},"Aberdeen City","Critical","JantoMar14",0,0,0,0,0,0,0,0,0,0,0,0]
["JantoMar14Aberdeen CitySubstantial","Aberdeen City","Substantial","JantoMar14",0.34,0.32,0.11,0.05,0.18,1,0,0.56000000000000005,0.33,0.06,0.06,1]
["JantoMar14Aberdeen CityModerate","Aberdeen City","Moderate","JantoMar14",0,0.5,0.5,0,0,1,0,0,0,1,0,1]
["JantoMar14Aberdeen CityLow or No Risk","Aberdeen City","Low or No Risk","JantoMar14",0.25,0,0.25,0,0.5,1,0,0,0,1,0,1]
["JantoMar14Aberdeen CityNot available","Aberdeen City","Not available","JantoMar14",0,0.67,0,0.33,0,1,0,0,0,0,0,0]
["JantoMar14Aberdeen CityTotals","Aberdeen City","Totals","JantoMar14",0.28999999999999998,0.33,0.14000000000000001,0.06,0.18,1,0,0.5,0.3,0.15,0.05,1]
["JantoMar14AberdeenshireCritical","Aberdeenshire","Critical","JantoMar14",0,0.75,0.25,0,0,1,0,0,0,0,0,0]
["JantoMar14AberdeenshireSubstantial","Aberdeenshire","Substantial","JantoMar14",0.1,0.6,0.2,0,0.1,1,0,0,0,0,0,0]
["JantoMar14AberdeenshireModerate","Aberdeenshire","Moderate","JantoMar14",0,0.4,0.27,0.2,0.13,1,0,0,0,0,0,0]
["JantoMar14AberdeenshireLow or No Risk","Aberdeenshire","Low or No Risk","JantoMar14",0,0.33,0.22,0.22,0.22,1,0,0,0,0,0,0]
["JantoMar14AberdeenshireNot available","Aberdeenshire","Not available","JantoMar14",0.09,0.38,0.2,0.09,0.24,1,0,0,0,0,0,0]
["JantoMar14AberdeenshireTotals","Aberdeenshire","Totals","JantoMar14",0.08,0.4,0.21,0.1,0.22,1,0,0,0,0,0,0]
["JantoMar14AngusCritical","Angus","Critical","JantoMar14",0.2,0.33,0.17,7.0000000000000007E-2,0.23,1,1,0,0,0,0,1]
["JantoMar14AngusSubstantial","Angus","Substantial","JantoMar14",0.57999999999999996,7.0000000000000007E-2,0.11,0.13,0.11,1,0.68,0.17,0.05,0.1,0,1]
["JantoMar14AngusModerate","Angus","Moderate","JantoMar14",0.78,0.09,7.0000000000000007E-2,0,7.0000000000000007E-2,1,0.75,0.25,0,0,0,1]
["JantoMar14AngusLow or No Risk","Angus","Low or No Risk","JantoMar14",0.98,0,0,0,0.02,1,0.98,0.02,0,0,0,1]
["JantoMar14AngusNot available","Angus","Not available","JantoMar14",1,0,0,0,0,1,0,1,0,0,0,1]
["JantoMar14AngusTotals","Angus","Totals","JantoMar14",0.75,0.08,0.06,0.04,0.08,1,0.79,0.17,0.01,0.02,0,1]
["JantoMar14Argyll & ButeCritical","Argyll & Bute","Critical","JantoMar14",0.47,0.3,0.12,0.01,0.1,1,0.24,0.33,0.19,7.0000000000000007E-2,0.17,1]
["JantoMar14Argyll & ButeSubstantial","Argyll & Bute","Substantial","JantoMar14",0.37,0.25,0.13,0.11,0.14000000000000001,1,0.18,0.33,0.2,0.05,0.25,1]
["JantoMar14Argyll & ButeModerate","Argyll & Bute","Moderate","JantoMar14",0.24,0.14000000000000001,0.24,0.05,0.33,1,0,0,0,1,0,1]
["JantoMar14Argyll & ButeLow or No Risk","Argyll & Bute","Low or No Risk","JantoMar14",0.33,0.33,0,0,0.33,1,0,0,0,0,0,0]
["JantoMar14Argyll & ButeNot available","Argyll & Bute","Not available","JantoMar14",0,0,0,0,0,0,0,0,0,0,0,0]
["JantoMar14Argyll & ButeTotals","Argyll & Bute","Totals","JantoMar14",0.39,0.26,0.14000000000000001,7.0000000000000007E-2,0.15,1,0.2,0.33,0.19,7.0000000000000007E-2,0.21,1]
["JantoMar14ClackmannanshireCritical","Clackmannanshire","Critical","JantoMar14",0,0,0,0,0,0,0,0,0,0,0,0]
["JantoMar14ClackmannanshireSubstantial","Clackmannanshire","Substantial","JantoMar14",0.19,0.28999999999999998,0.19,0.1,0.24,1,0,0,0,0,0,0]
["JantoMar14ClackmannanshireModerate","Clackmannanshire","Moderate","JantoMar14",0,0.17,0.13,0.26,0.43,1,0,0,0,0,0,0]
["JantoMar14ClackmannanshireLow or No Risk","Clackmannanshire","Low or No Risk","JantoMar14",0,0,0.1,0.15,0.74,1,0,0,0,0,0,0]
["JantoMar14ClackmannanshireNot available","Clackmannanshire","Not available","JantoMar14",0,0,0,0,0,0,0.62,0.28000000000000003,0.04,0.01,0.04,1]
["JantoMar14ClackmannanshireTotals","Clackmannanshire","Totals","JantoMar14",0.05,0.12,0.13,0.17,0.53,1,0.62,0.28000000000000003,0.04,0.01,0.04,1]
["JantoMar14Dumfries and GallowayCritical","Dumfries and Galloway","Critical","JantoMar14",0,0,0,0,0,0,0,0,0,0,0,0]
["JantoMar14Dumfries and GallowaySubstantial","Dumfries and Galloway","Substantial","JantoMar14",0,0,0,0,0,0,0,0,0,0,0,0]
["JantoMar14Dumfries and GallowayModerate","Dumfries and Galloway","Moderate","JantoMar14",0,0,0,0,0,0,0,0,0,0,0,0]
["JantoMar14Dumfries and GallowayLow or No Risk","Dumfries and Galloway","Low or No Risk","JantoMar14",0,0,0,0,0,0,0,0,0,0,0,0]
["JantoMar14Dumfries and GallowayNot available","Dumfries and Galloway","Not available","JantoMar14",0.4,0.36,0.13,0.03,0.08,1,0.03,0.69,0.17,0.08,0.03,1]
["JantoMar14Dumfries and GallowayTotals","Dumfries and Galloway","Totals","JantoMar14",0.4,0.36,0.13,0.03,0.08,1,0.03,0.69,0.17,0.08,0.03,1]
["JantoMar14Dundee CityCritical","Dundee City","Critical","JantoMar14",0.37,0.37,0.17,0.09,0,1,0.05,0.84,0.11,0,0,1]
["JantoMar14Dundee CitySubstantial","Dundee City","Substantial","JantoMar14",0.12,0.52,0.06,0.12,0.18,1,0.1,0.8,0,0.1,0,1]
["JantoMar14Dundee CityModerate","Dundee City","Moderate","JantoMar14",0.06,0.39,0.11,0.12,0.33,1,0.31,0.56000000000000005,0.13,0,0,1]
["JantoMar14Dundee CityLow or No Risk","Dundee City","Low or No Risk","JantoMar14",0.06,0.2,0.08,0.1,0.56999999999999995,1,0,0.83,0,0.17,0,1]
["JantoMar14Dundee CityNot available","Dundee City","Not available","JantoMar14",0,0,0,0,0,0,1,0,0,0,0,1]
["JantoMar14Dundee CityTotals","Dundee City","Totals","JantoMar14",0.1,0.37,0.11,0.11,0.32,1,0.15,0.73,0.08,0.04,0,1]
["JantoMar14East AyrshireCritical","East Ayrshire","Critical","JantoMar14",0.22,0.25,0.35,7.0000000000000007E-2,0.11,1,0.96,0.04,0,0,0,1]
["JantoMar14East AyrshireSubstantial","East Ayrshire","Substantial","JantoMar14",0.09,0.13,0.1,0.09,0.59,1,0.33,0.45,0.18,0.03,0,1]
["JantoMar14East AyrshireModerate","East Ayrshire","Moderate","JantoMar14",0.21,0.12,0.08,0.12,0.48,1,0.64,0.27,0.09,0,0,1]
["JantoMar14East AyrshireLow or No Risk","East Ayrshire","Low or No Risk","JantoMar14",0.06,0.21,0.12,0.15,0.45,1,0.25,0.75,0,0,0,1]
["JantoMar14East AyrshireNot available","East Ayrshire","Not available","JantoMar14",0,0,0,0,0,0,0,0,0,0,0,0]
["JantoMar14East AyrshireTotals","East Ayrshire","Totals","JantoMar14",0.16,0.16,0.14000000000000001,0.11,0.44,1,0.84,0.13,0.03,0,0,1]
["JantoMar14East DunbartonshireCritical","East Dunbartonshire","Critical","JantoMar14",0.31,0.46,0.23,0,0,1,0,1,0,0,0,1]
["JantoMar14East DunbartonshireSubstantial","East Dunbartonshire","Substantial","JantoMar14",0.2,0.27,0.23,0.21,0.09,1,0,0.97,0.02,0.01,0,1]
["JantoMar14East DunbartonshireModerate","East Dunbartonshire","Moderate","JantoMar14",0.04,0.15,0.06,0.03,0.72,1,0,1,0,0,0,1]
["JantoMar14East DunbartonshireLow or No Risk","East Dunbartonshire","Low or No Risk","JantoMar14",0.18,0.27,0.18,0,0.36,1,0,1,0,0,0,1]
["JantoMar14East DunbartonshireNot available","East Dunbartonshire","Not available","JantoMar14",0,0,0,0,0,0,0,1,0,0,0,1]
["JantoMar14East DunbartonshireTotals","East Dunbartonshire","Totals","JantoMar14",0.16,0.25,0.17,0.13,0.3,1,0,0.98,0.02,0.01,0,1]
["JantoMar14East LothianCritical","East Lothian","Critical","JantoMar14",0,0,0,0,0,0,0.33,0.67,0,0,0,1]
["JantoMar14East LothianSubstantial","East Lothian","Substantial","JantoMar14",0.28999999999999998,0.12,0.11,0.18,0.3,1,0.15,0.53,0.16,0.12,0.03,1]
["JantoMar14East LothianModerate","East Lothian","Moderate","JantoMar14",0,0,0,0,0,0,0,0,0,0,0,0]
["JantoMar14East LothianLow or No Risk","East Lothian","Low or No Risk","JantoMar14",0,0,0,0,0,0,0,0,0,0,0,0]
["JantoMar14East LothianNot available","East Lothian","Not available","JantoMar14",0,0,0,0,0,0,0,0,0,0,0,0]
["JantoMar14East LothianTotals","East Lothian","Totals","JantoMar14",0.28999999999999998,0.12,0.11,0.18,0.3,1,0.16,0.54,0.16,0.11,0.03,1]
["JantoMar14East RenfrewshireCritical","East Renfrewshire","Critical","JantoMar14",0.38,0.38,0.22,0.03,0,1,0,0.75,0.25,0,0,1]
["JantoMar14East RenfrewshireSubstantial","East Renfrewshire","Substantial","JantoMar14",0.31,0.69,0,0,0,1,0.31,0.69,0,0,0,1]
["JantoMar14East RenfrewshireModerate","East Renfrewshire","Moderate","JantoMar14",0.36,0.36,0.28999999999999998,0,0,1,0.21,0.79,0,0,0,1]
["JantoMar14East RenfrewshireLow or No Risk","East Renfrewshire","Low or No Risk","JantoMar14",0,0.67,0,0.33,0,1,0,0.67,0.33,0,0,1]
[{"$f":"D2443&B2443&C2443","v":"JantoMar14East RenfrewshireNot available"},"East Renfrewshire","Not available","JantoMar14",0.49,0.44,0,7.0000000000000007E-2,0,1,0.02,0.93,0.05,0,0,1]
["JantoMar14East RenfrewshireTotals","East Renfrewshire","Totals","JantoMar14",0.39,0.43,0.14000000000000001,0.04,0,1,0.06,0.8,0.14000000000000001,0,0,1]
["JantoMar14Edinburgh, City ofCritical","Edinburgh, City of","Critical","JantoMar14",0,0,0,0,0,0,0,0,0,0,0,0]
["JantoMar14Edinburgh, City ofSubstantial","Edinburgh, City of","Substantial","JantoMar14",0,0,0,0,0,0,0,0,0,0,0,0]
["JantoMar14Edinburgh, City ofModerate","Edinburgh, City of","Moderate","JantoMar14",0,0,0,0,0,0,0,0,0,0,0,0]
["JantoMar14Edinburgh, City ofLow or No Risk","Edinburgh, City of","Low or No Risk","JantoMar14",0,0,0,0,0,0,0,0,0,0,0,0]
["JantoMar14Edinburgh, City ofNot available","Edinburgh, City of","Not available","JantoMar14",0.2,0.16,0.19,0.2,0.25,1,0.02,0.63,0.18,0.12,0.05,1]
["JantoMar14Edinburgh, City ofTotals","Edinburgh, City of","Totals","JantoMar14",0.2,0.16,0.19,0.2,0.25,1,0.02,0.63,0.18,0.12,0.05,1]
["JantoMar14Eilean SiarCritical","Eilean Siar","Critical","JantoMar14",0,0.67,0,0.33,0,1,0.33,0.67,0,0,0,1]
["JantoMar14Eilean SiarSubstantial","Eilean Siar","Substantial","JantoMar14",0,0.56999999999999995,0.43,0,0,1,0.86,0,0,0,0.14000000000000001,1]
["JantoMar14Eilean SiarModerate","Eilean Siar","Moderate","JantoMar14",0,0,0,0,0,0,0,0,0,0,0,0]
["JantoMar14Eilean SiarLow or No Risk","Eilean Siar","Low or No Risk","JantoMar14",0,0,0,0,0,0,0,0,0,0,0,0]
["JantoMar14Eilean SiarNot available","Eilean Siar","Not available","JantoMar14",0.56999999999999995,0.14000000000000001,0.14000000000000001,0.14000000000000001,0,1,0.28999999999999998,0.56999999999999995,0.14000000000000001,0,0,1]
["JantoMar14Eilean SiarTotals","Eilean Siar","Totals","JantoMar14",0.24,0.41,0.24,0.12,0,1,0.53,0.35,0.06,0,0.06,1]
["JantoMar14FalkirkCritical","Falkirk","Critical","JantoMar14",0,0,0,0,0,0,0,0,0,0,0,0]
["JantoMar14FalkirkSubstantial","Falkirk","Substantial","JantoMar14",0,0,0,0,0,0,0,0,0,0,0,0]
["JantoMar14FalkirkModerate","Falkirk","Moderate","JantoMar14",0,0,0,0,0,0,0,0,0,0,0,0]
["JantoMar14FalkirkLow or No Risk","Falkirk","Low or No Risk","JantoMar14",0,0,0,0,0,0,0,0,0,0,0,0]
["JantoMar14FalkirkNot available","Falkirk","Not available","JantoMar14",0,0,0,0,0,0,0,0,0,0,0,0]
["JantoMar14FalkirkTotals","Falkirk","Totals","JantoMar14",0,0,0,0,0,0,0,0,0,0,0,0]
["JantoMar14FifeCritical","Fife","Critical","JantoMar14",0.17,0.6,0.11,0.08,0.04,1,0.2,0.42,0.24,0.11,0.03,1]
["JantoMar14FifeSubstantial","Fife","Substantial","JantoMar14",0.04,0.22,0.2,0.16,0.38,1,0.23,0.48,0.21,0.06,0.02,1]
["JantoMar14FifeModerate","Fife","Moderate","JantoMar14",0.01,0.08,0.18,0.2,0.53,1,0.37,0.21,0.26,0.11,0.05,1]
["JantoMar14FifeLow or No Risk","Fife","Low or No Risk","JantoMar14",0,0,0.03,0,0.97,1,0,0,0,0,0,0]
["JantoMar14FifeNot available","Fife","Not available","JantoMar14",0,0.33,0,0,0.67,1,1,0,0,0,0,1]
["JantoMar14FifeTotals","Fife","Totals","JantoMar14",0.05,0.21,0.17,0.15,0.41,1,0.24,0.45,0.22,7.0000000000000007E-2,0.02,1]
["JantoMar14Glasgow CityCritical","Glasgow City","Critical","JantoMar14",0.02,0.14000000000000001,0.17,0.04,0.63,1,0,1,0,0,0,1]
["JantoMar14Glasgow CitySubstantial","Glasgow City","Substantial","JantoMar14",0.06,0.11,0.12,0.08,0.64,1,0,1,0,0,0,1]
["JantoMar14Glasgow CityModerate","Glasgow City","Moderate","JantoMar14",0.1,0.24,0.04,0.04,0.56999999999999995,1,0,1,0,0,0,1]
["JantoMar14Glasgow CityLow or No Risk","Glasgow City","Low or No Risk","JantoMar14",0.09,0.27,0.09,0.05,0.5,1,0,1,0,0,0,1]
["JantoMar14Glasgow CityNot available","Glasgow City","Not available","JantoMar14",0.14000000000000001,0.48,7.0000000000000007E-2,0.09,0.22,1,0,1,0,0,0,1]
["JantoMar14Glasgow CityTotals","Glasgow City","Totals","JantoMar14",0.09,0.26,0.09,7.0000000000000007E-2,0.5,1,0,1,0,0,0,1]
["JantoMar14HighlandCritical","Highland","Critical","JantoMar14",0.23,0.44,0.05,0.09,0.2,1,0,0,0,0,0,0]
["JantoMar14HighlandSubstantial","Highland","Substantial","JantoMar14",0.14000000000000001,0.2,0.06,0.13,0.48,1,0,0,0,0,0,0]
["JantoMar14HighlandModerate","Highland","Moderate","JantoMar14",0.2,0.15,0.21,7.0000000000000007E-2,0.38,1,0,0,0,0,0,0]
["JantoMar14HighlandLow or No Risk","Highland","Low or No Risk","JantoMar14",0,0.2,0,0.1,0.7,1,0,0,0,0,0,0]
["JantoMar14HighlandNot available","Highland","Not available","JantoMar14",0.04,0.13,0.04,0.11,0.66,1,0,0,0,0,0,0]
["JantoMar14HighlandTotals","Highland","Totals","JantoMar14",0.14000000000000001,0.23,0.08,0.1,0.45,1,0,0,0,0,0,0]
["JantoMar14InverclydeCritical","Inverclyde","Critical","JantoMar14",0.33,0.33,0.33,0,0,1,0.33,0.56000000000000005,0.11,0,0,1]
["JantoMar14InverclydeSubstantial","Inverclyde","Substantial","JantoMar14",0.65,0.18,0,0.06,0.12,1,0.68,0.28999999999999998,0.03,0,0,1]
["JantoMar14InverclydeModerate","Inverclyde","Moderate","JantoMar14",0.17,0.33,0,0.33,0.17,1,0.67,0.11,0.11,0.11,0,1]
["JantoMar14InverclydeLow or No Risk","Inverclyde","Low or No Risk","JantoMar14",0,0,0,0,1,1,1,0,0,0,0,1]
["JantoMar14InverclydeNot available","Inverclyde","Not available","JantoMar14",0.33,0,0.22,0.22,0.22,1,0,0,1,0,0,1]
["JantoMar14InverclydeTotals","Inverclyde","Totals","JantoMar14",0.44,0.17,0.08,0.14000000000000001,0.17,1,0.62,0.28999999999999998,7.0000000000000007E-2,0.02,0,1]
["JantoMar14MidlothianCritical","Midlothian","Critical","JantoMar14",0,0,0,0,0,0,0,0,0,0,0,0]
["JantoMar14MidlothianSubstantial","Midlothian","Substantial","JantoMar14",0,0,0,0,0,0,0,0,0,0,0,0]
["JantoMar14MidlothianModerate","Midlothian","Moderate","JantoMar14",0,0,0,0,0,0,0,0,0,0,0,0]
["JantoMar14MidlothianLow or No Risk","Midlothian","Low or No Risk","JantoMar14",0,0,0,0,0,0,0,0,0,0,0,0]
["JantoMar14MidlothianNot available","Midlothian","Not available","JantoMar14",0.02,0.27,0.23,0.11,0.38,1,0,0,0,0,0,0]
["JantoMar14MidlothianTotals","Midlothian","Totals","JantoMar14",0.02,0.27,0.23,0.11,0.38,1,0,0,0,0,0,0]
["JantoMar14MorayCritical","Moray","Critical","JantoMar14",0.2,0.4,0.2,0.1,0.1,1,0.31,0.62,0,0,0.08,1]
["JantoMar14MoraySubstantial","Moray","Substantial","JantoMar14",0.02,0.24,0.28999999999999998,0.16,0.28999999999999998,1,0.34,0.38,0.14000000000000001,0.08,0.06,1]
["JantoMar14MorayModerate","Moray","Moderate","JantoMar14",0.25,0,0.25,0.5,0,1,0.33,0.33,0.33,0,0,1]
["JantoMar14MorayLow or No Risk","Moray","Low or No Risk","JantoMar14",0,0,0,0,0,0,0,0,0,0,0,0]
["JantoMar14MorayNot available","Moray","Not available","JantoMar14",0.13,0.38,0,0.38,0.13,1,0.17,0.75,0,0.08,0,1]
["JantoMar14MorayTotals","Moray","Totals","JantoMar14",7.0000000000000007E-2,0.27,0.24,0.19,0.22,1,0.32,0.46,0.11,7.0000000000000007E-2,0.05,1]
["JantoMar14North AyrshireCritical","North Ayrshire","Critical","JantoMar14",0.04,0.49,0.33,0.08,0.06,1,0,0,0,0,0,0]
["JantoMar14North AyrshireSubstantial","North Ayrshire","Substantial","JantoMar14",0,0.39,0.11,0.06,0.44,1,0,0,0,0,0,0]
["JantoMar14North AyrshireModerate","North Ayrshire","Moderate","JantoMar14",0,0.09,0.18,0.09,0.64,1,0,0,0,0,0,0]
["JantoMar14North AyrshireLow or No Risk","North Ayrshire","Low or No Risk","JantoMar14",0,0.3,0,0.2,0.5,1,0,0,0,0,0,0]
["JantoMar14North AyrshireNot available","North Ayrshire","Not available","JantoMar14",0,0.22,0.33,0,0.44,1,0,0,0,0,0,0]
["JantoMar14North AyrshireTotals","North Ayrshire","Totals","JantoMar14",0.02,0.38,0.2,0.08,0.32,1,0,0,0,0,0,0]
["JantoMar14North LanarkshireCritical","North Lanarkshire","Critical","JantoMar14",0.65,0.2,0.08,0.03,0.04,1,0.28999999999999998,0.68,0.03,0,0,1]
["JantoMar14North LanarkshireSubstantial","North Lanarkshire","Substantial","JantoMar14",0.32,0.34,0.19,7.0000000000000007E-2,0.09,1,0.33,0.61,0.01,0.01,0.03,1]
[{"$f":"D2507&B2507&C2507","v":"JantoMar14North LanarkshireModerate"},"North Lanarkshire","Moderate","JantoMar14",0.28999999999999998,0.35,0.18,7.0000000000000007E-2,0.1,1,0.37,0.57999999999999996,0.03,0.02,0,1]
["JantoMar14North LanarkshireLow or No Risk","North Lanarkshire","Low or No Risk","JantoMar14",0.36,0.3,0.14000000000000001,0.06,0.14000000000000001,1,0.26,0.57999999999999996,0.05,0,0.11,1]
["JantoMar14North LanarkshireNot available","North Lanarkshire","Not available","JantoMar14",0,0,0,0,0,0,0,0,0,0,0,0]
["JantoMar14North LanarkshireTotals","North Lanarkshire","Totals","JantoMar14",0.47,0.27,0.14000000000000001,0.05,7.0000000000000007E-2,1,0.31,0.64,0.02,0.01,0.01,1]
["JantoMar14Orkney islandsCritical","Orkney islands","Critical","JantoMar14",0,0,0,0,0,0,0,0,0,0,0,0]
["JantoMar14Orkney islandsSubstantial","Orkney islands","Substantial","JantoMar14",0,0,0,0,0,0,0,0,0,0,0,0]
["JantoMar14Orkney islandsModerate","Orkney islands","Moderate","JantoMar14",0,0,0,0,0,0,0,0,0,0,0,0]
["JantoMar14Orkney islandsLow or No Risk","Orkney islands","Low or No Risk","JantoMar14",0,0,0,0,0,0,0,0,0,0,0,0]
["JantoMar14Orkney islandsNot available","Orkney islands","Not available","JantoMar14",0,0,0,0,0,0,0,0,0,0,0,0]
["JantoMar14Orkney islandsTotals","Orkney islands","Totals","JantoMar14",0,0,0,0,0,0,0,0,0,0,0,0]
["JantoMar14Perth & KinrossCritical","Perth & Kinross","Critical","JantoMar14",0.14000000000000001,0.43,0.28999999999999998,0,0.14000000000000001,1,0,0.5,0.5,0,0,1]
["JantoMar14Perth & KinrossSubstantial","Perth & Kinross","Substantial","JantoMar14",0.24,0.22,0.22,0.09,0.22,1,0.06,0.63,0.11,0.06,0.14000000000000001,1]
["JantoMar14Perth & KinrossModerate","Perth & Kinross","Moderate","JantoMar14",0.34,0.27,0.12,0.06,0.21,1,0.04,0.67,0.12,0.05,0.12,1]
["JantoMar14Perth & KinrossLow or No Risk","Perth & Kinross","Low or No Risk","JantoMar14",0.13,0.5,0.06,0.13,0.19,1,0,0.5,0,0.5,0,1]
["JantoMar14Perth & KinrossNot available","Perth & Kinross","Not available","JantoMar14",0.15,0.37,0.17,0.05,0.27,1,0.03,0.51,0.2,0.09,0.17,1]
["JantoMar14Perth & KinrossTotals","Perth & Kinross","Totals","JantoMar14",0.26,0.3,0.15,7.0000000000000007E-2,0.22,1,0.03,0.54,0.18,0.08,0.16,1]
["JantoMar14RenfrewshireCritical","Renfrewshire","Critical","JantoMar14",0.87,0.1,0,0,0.03,1,0.22,0.57999999999999996,0.14000000000000001,0.06,0,1]
["JantoMar14RenfrewshireSubstantial","Renfrewshire","Substantial","JantoMar14",0.74,0.11,0.11,0,0.05,1,0.4,0.27,0.17,0.08,0.08,1]
["JantoMar14RenfrewshireModerate","Renfrewshire","Moderate","JantoMar14",0.43,0.43,0.14000000000000001,0,0,1,0.67,7.0000000000000007E-2,7.0000000000000007E-2,7.0000000000000007E-2,0.13,1]
["JantoMar14RenfrewshireLow or No Risk","Renfrewshire","Low or No Risk","JantoMar14",0.92,0,0.08,0,0,1,0.8,7.0000000000000007E-2,7.0000000000000007E-2,7.0000000000000007E-2,0,1]
["JantoMar14RenfrewshireNot available","Renfrewshire","Not available","JantoMar14",0.69,0.08,0.03,0.02,0.17,1,0.56000000000000005,0.22,0.08,7.0000000000000007E-2,7.0000000000000007E-2,1]
["JantoMar14RenfrewshireTotals","Renfrewshire","Totals","JantoMar14",0.72,0.09,0.04,0.02,0.13,1,0.5,0.27,0.1,7.0000000000000007E-2,0.06,1]
["JantoMar14Scottish BordersCritical","Scottish Borders","Critical","JantoMar14",0.18,0.27,0.17,0.08,0.3,1,0.08,0.69,0.18,0.04,0,1]
["JantoMar14Scottish BordersSubstantial","Scottish Borders","Substantial","JantoMar14",0.14000000000000001,0.1,0.08,0.06,0.61,1,0,0.67,0.33,0,0,1]
["JantoMar14Scottish BordersModerate","Scottish Borders","Moderate","JantoMar14",0,0,0,0,1,1,0,0,0,0,0,0]
["JantoMar14Scottish BordersLow or No Risk","Scottish Borders","Low or No Risk","JantoMar14",0,0,0.2,0.2,0.6,1,0,0,0,0,0,0]
["JantoMar14Scottish BordersNot available","Scottish Borders","Not available","JantoMar14",0,0,0,0,0,0,0,0,0,0,0,0]
["JantoMar14Scottish BordersTotals","Scottish Borders","Totals","JantoMar14",0.17,0.23,0.15,0.08,0.37,1,0.08,0.69,0.19,0.04,0,1]
["JantoMar14Shetland islandsCritical","Shetland islands","Critical","JantoMar14",0,0.56999999999999995,0.14000000000000001,0.14000000000000001,0.14000000000000001,1,0.11,0.67,0.22,0,0,1]
["JantoMar14Shetland islandsSubstantial","Shetland islands","Substantial","JantoMar14",0.28999999999999998,0.28999999999999998,0.28999999999999998,0,0.14000000000000001,1,0.09,0.64,0.18,0.09,0,1]
["JantoMar14Shetland islandsModerate","Shetland islands","Moderate","JantoMar14",0,0,0,0,0,0,0,1,0,0,0,1]
["JantoMar14Shetland islandsLow or No Risk","Shetland islands","Low or No Risk","JantoMar14",0,0,0,0,0,0,0,0,0,0,0,0]
["JantoMar14Shetland islandsNot available","Shetland islands","Not available","JantoMar14",0.14000000000000001,0.21,0.18,0.14000000000000001,0.32,1,0.13,0.75,0.13,0,0,1]
["JantoMar14Shetland islandsTotals","Shetland islands","Totals","JantoMar14",0.14000000000000001,0.28999999999999998,0.19,0.12,0.26,1,0.09,0.72,0.16,0.03,0,1]
["JantoMar14South AyrshireCritical","South Ayrshire","Critical","JantoMar14",0.47,0.34,0.15,0.04,0,1,0.67,0.28999999999999998,0.05,0,0,1]
["JantoMar14South AyrshireSubstantial","South Ayrshire","Substantial","JantoMar14",0.28000000000000003,0.5,0.06,0.17,0,1,0.54,0.41,0.05,0,0,1]
["JantoMar14South AyrshireModerate","South Ayrshire","Moderate","JantoMar14",0.27,0.37,0.27,0.1,0,1,0.42,0.42,0.16,0,0,1]
["JantoMar14South AyrshireLow or No Risk","South Ayrshire","Low or No Risk","JantoMar14",0.44,0.32,0.18,0.06,0,1,0.7,0.13,0.17,0,0,1]
["JantoMar14South AyrshireNot available","South Ayrshire","Not available","JantoMar14",0,0,0,0,0,0,0,0,0,0,0,0]
["JantoMar14South AyrshireTotals","South Ayrshire","Totals","JantoMar14",0.39,0.36,0.17,0.08,0,1,0.6,0.31,0.09,0,0,1]
["JantoMar14South LanarkshireCritical","South Lanarkshire","Critical","JantoMar14",0,0,0,0,0,0,0,0,0,0,0,0]
["JantoMar14South LanarkshireSubstantial","South Lanarkshire","Substantial","JantoMar14",0,0,0,0,0,0,0,0,0,0,0,0]
["JantoMar14South LanarkshireModerate","South Lanarkshire","Moderate","JantoMar14",0,0,0,0,0,0,0,0,0,0,0,0]
["JantoMar14South LanarkshireLow or No Risk","South Lanarkshire","Low or No Risk","JantoMar14",0,0,0,0,0,0,0,0,0,0,0,0]
["JantoMar14South LanarkshireNot available","South Lanarkshire","Not available","JantoMar14",0,0,0,0,0,0,0,0,0,0,0,0]
["JantoMar14South LanarkshireTotals","South Lanarkshire","Totals","JantoMar14",0,0,0,0,0,0,0,0,0,0,0,0]
["JantoMar14StirlingCritical","Stirling","Critical","JantoMar14",0.88,0.09,0.01,0,0.01,1,0,0.81,0.19,0,0,1]
["JantoMar14StirlingSubstantial","Stirling","Substantial","JantoMar14",0.62,0.18,0.03,0.02,0.16,1,7.0000000000000007E-2,0.66,0.28000000000000003,0,0,1]
["JantoMar14StirlingModerate","Stirling","Moderate","JantoMar14",0.17,0,0,0,0.83,1,0,1,0,0,0,1]
["JantoMar14StirlingLow or No Risk","Stirling","Low or No Risk","JantoMar14",0,0,0,0,1,1,0,1,0,0,0,1]
["JantoMar14StirlingNot available","Stirling","Not available","JantoMar14",0.34,0.14000000000000001,0.15,0.08,0.28999999999999998,1,0.28999999999999998,0.38,0.28999999999999998,0,0.05,1]
["JantoMar14StirlingTotals","Stirling","Totals","JantoMar14",0.62,0.14000000000000001,0.05,0.03,0.17,1,0.08,0.67,0.23,0,0.01,1]
["JantoMar14West DunbartonshireCritical","West Dunbartonshire","Critical","JantoMar14",0.39,0.35,0.04,0.13,0.09,1,1,0,0,0,0,1]
["JantoMar14West DunbartonshireSubstantial","West Dunbartonshire","Substantial","JantoMar14",0.5,0.35,0.06,0.05,0.05,1,1,0,0,0,0,1]
["JantoMar14West DunbartonshireModerate","West Dunbartonshire","Moderate","JantoMar14",0.2,0.34,0.2,7.0000000000000007E-2,0.19,1,0.59,0.24,0.12,0.06,0,1]
["JantoMar14West DunbartonshireLow or No Risk","West Dunbartonshire","Low or No Risk","JantoMar14",0.19,0.35,0.32,0.1,0.05,1,0.75,0,0.25,0,0,1]
["JantoMar14West DunbartonshireNot available","West Dunbartonshire","Not available","JantoMar14",0,0,0,0,0,0,0,0,0,0,0,0]
["JantoMar14West DunbartonshireTotals","West Dunbartonshire","Totals","JantoMar14",0.33,0.34,0.15,7.0000000000000007E-2,0.09,1,0.93,0.03,0.03,0.01,0,1]
["JantoMar14West LothianCritical","West Lothian","Critical","JantoMar14",0.13,0.5,0.2,0.03,0.13,1,0.08,0.63,0.21,0.04,0.04,1]
["JantoMar14West LothianSubstantial","West Lothian","Substantial","JantoMar14",0.24,0.41,0.21,0.03,0.12,1,0,0.5,0.36,0,0.14000000000000001,1]
["JantoMar14West LothianModerate","West Lothian","Moderate","JantoMar14",0.18,0.38,0.28000000000000003,0.08,0.08,1,0.22,0.56000000000000005,0.22,0,0,1]
["JantoMar14West LothianLow or No Risk","West Lothian","Low or No Risk","JantoMar14",0.17,0.22,0.28000000000000003,0.33,0,1,0,0.5,0.5,0,0,1]
["JantoMar14West LothianNot available","West Lothian","Not available","JantoMar14",0,0,0.33,0.67,0,1,0,0,0,0,0,0]
["JantoMar14West LothianTotals","West Lothian","Totals","JantoMar14",0.18,0.39,0.24,0.1,0.09,1,0.08,0.56999999999999995,0.27,0.02,0.06,1]
[{"$f":"D2571&B2571&C2571","v":"JantoMar14SCOTLAND TOTALSCritical"},"SCOTLAND TOTALS","Critical","JantoMar14",0.36,0.3,0.14000000000000001,0.05,0.15,1,0.41,0.47,0.09,0.02,0.01,1]
["JantoMar14SCOTLAND TOTALSSubstantial","SCOTLAND TOTALS","Substantial","JantoMar14",0.22,0.22,0.14000000000000001,0.1,0.32,1,0.22,0.6,0.11,0.04,0.03,1]
["JantoMar14SCOTLAND TOTALSModerate","SCOTLAND TOTALS","Moderate","JantoMar14",0.16,0.24,0.13,0.09,0.37,1,0.23,0.65,0.06,0.03,0.03,1]
["JantoMar14SCOTLAND TOTALSLow or No Risk","SCOTLAND TOTALS","Low or No Risk","JantoMar14",0.32,0.19,0.12,0.08,0.28999999999999998,1,0.64,0.28999999999999998,0.04,0.02,0.01,1]
["JantoMar14SCOTLAND TOTALSNot available","SCOTLAND TOTALS","Not available","JantoMar14",0.23,0.25,0.15,0.13,0.25,1,0.12,0.62,0.13,7.0000000000000007E-2,7.0000000000000007E-2,1]
["JantoMar14SCOTLAND TOTALSTotals","SCOTLAND TOTALS","Totals","JantoMar14",0.24,0.24,0.14000000000000001,0.1,0.28000000000000003,1,0.24,0.56999999999999995,0.1,0.04,0.04,1]
[{"$f":"D2577&B2577&C2577","v":"JantoMar15Aberdeen CityCritical"},"Aberdeen City","Critical","JantoMar15",1,0,0,0,0,1,0,0,0,0,0,0]
["JantoMar15Aberdeen CitySubstantial","Aberdeen City","Substantial","JantoMar15",0.37,0.23,7.0000000000000007E-2,0.03,0.3,1,0.67,0.2,7.0000000000000007E-2,7.0000000000000007E-2,0,1]
["JantoMar15Aberdeen CityModerate","Aberdeen City","Moderate","JantoMar15",0.5,0.08,0,0,0.42,1,0,0,0,0,0,0]
["JantoMar15Aberdeen CityLow or No Risk","Aberdeen City","Low or No Risk","JantoMar15",0.33,0.33,0.11,0,0.22,1,1,0,0,0,0,1]
["JantoMar15Aberdeen CityNot available","Aberdeen City","Not available","JantoMar15",0.38,0.19,0.13,0.06,0.25,1,0.5,0,0.5,0,0,1]
["JantoMar15Aberdeen CityTotals","Aberdeen City","Totals","JantoMar15",0.4,0.21,7.0000000000000007E-2,0.03,0.28999999999999998,1,0.67,0.17,0.11,0.06,0,1]
["JantoMar15AberdeenshireCritical","Aberdeenshire","Critical","JantoMar15",0,0.25,0.25,0,0.5,1,0,0,0,0,0,0]
["JantoMar15AberdeenshireSubstantial","Aberdeenshire","Substantial","JantoMar15",0.14000000000000001,0.35,0.22,0.18,0.11,1,0,0,0,0,0,0]
["JantoMar15AberdeenshireModerate","Aberdeenshire","Moderate","JantoMar15",0.09,0.2,0.28999999999999998,0.13,0.3,1,0,0,0,0,0,0]
["JantoMar15AberdeenshireLow or No Risk","Aberdeenshire","Low or No Risk","JantoMar15",0,0.17,0.42,0,0.42,1,0,0,0,0,0,0]
["JantoMar15AberdeenshireNot available","Aberdeenshire","Not available","JantoMar15",0.06,0.18,0.2,0.11,0.45,1,0,0,0,0,0,0]
["JantoMar15AberdeenshireTotals","Aberdeenshire","Totals","JantoMar15",0.09,0.24,0.24,0.13,0.3,1,0,0,0,0,0,0]
["JantoMar15AngusCritical","Angus","Critical","JantoMar15",0.14000000000000001,0,0.28999999999999998,0.28999999999999998,0.28999999999999998,1,0.82,0.06,0.02,0.02,0.08,1]
["JantoMar15AngusSubstantial","Angus","Substantial","JantoMar15",0.57999999999999996,0.08,0.08,0,0.25,1,0.8,0.08,7.0000000000000007E-2,0,0.05,1]
["JantoMar15AngusModerate","Angus","Moderate","JantoMar15",0.22,0.06,0.17,0.17,0.39,1,0.82,0.03,0,0,0.15,1]
["JantoMar15AngusLow or No Risk","Angus","Low or No Risk","JantoMar15",0.97,0,0,0,0.03,1,1,0,0,0,0,1]
["JantoMar15AngusNot available","Angus","Not available","JantoMar15",0,0,0,1,0,1,0,0,0,0,0,0]
["JantoMar15AngusTotals","Angus","Totals","JantoMar15",0.65,0.03,0.08,0.08,0.17,1,0.82,0.06,0.03,0.01,0.08,1]
["JantoMar15Argyll & ButeCritical","Argyll & Bute","Critical","JantoMar15",0.44,0.28999999999999998,0.15,0.05,7.0000000000000007E-2,1,0.47,0.27,0.2,0.03,0.03,1]
["JantoMar15Argyll & ButeSubstantial","Argyll & Bute","Substantial","JantoMar15",0.23,0.39,0.14000000000000001,0.09,0.14000000000000001,1,0.37,0.32,0.17,0.08,0.05,1]
["JantoMar15Argyll & ButeModerate","Argyll & Bute","Moderate","JantoMar15",0.3,0.25,0.2,0.1,0.15,1,0.5,0,0,0.25,0.25,1]
["JantoMar15Argyll & ButeLow or No Risk","Argyll & Bute","Low or No Risk","JantoMar15",0,0,0,0,1,1,1,0,0,0,0,1]
["JantoMar15Argyll & ButeNot available","Argyll & Bute","Not available","JantoMar15",0,0,0,0,0,0,0,0,0,0,0,0]
["JantoMar15Argyll & ButeTotals","Argyll & Bute","Totals","JantoMar15",0.28999999999999998,0.33,0.16,0.08,0.14000000000000001,1,0.41,0.28999999999999998,0.17,7.0000000000000007E-2,0.05,1]
["JantoMar15ClackmannanshireCritical","Clackmannanshire","Critical","JantoMar15",0,0,0,0,1,1,0,0,0,0,0,0]
["JantoMar15ClackmannanshireSubstantial","Clackmannanshire","Substantial","JantoMar15",0.05,0.3,0.2,0.1,0.35,1,0,0,0,0,0,0]
["JantoMar15ClackmannanshireModerate","Clackmannanshire","Moderate","JantoMar15",0.09,0.05,0,0.05,0.82,1,0,0,0,0,0,0]
["JantoMar15ClackmannanshireLow or No Risk","Clackmannanshire","Low or No Risk","JantoMar15",0.05,0.09,0.09,7.0000000000000007E-2,0.7,1,0,0,0,0,0,0]
["JantoMar15ClackmannanshireNot available","Clackmannanshire","Not available","JantoMar15",0,0,0,0,0,0,0.63,0.17,0.03,0,0.16,1]
["JantoMar15ClackmannanshireTotals","Clackmannanshire","Totals","JantoMar15",0.06,0.13,0.09,7.0000000000000007E-2,0.66,1,0.63,0.17,0.03,0,0.16,1]
["JantoMar15Dumfries and GallowayCritical","Dumfries and Galloway","Critical","JantoMar15",0,0,0,0,0,0,0,0,0,0,0,0]
["JantoMar15Dumfries and GallowaySubstantial","Dumfries and Galloway","Substantial","JantoMar15",0,0,0,0,0,0,0,0,0,0,0,0]
["JantoMar15Dumfries and GallowayModerate","Dumfries and Galloway","Moderate","JantoMar15",0,0,0,0,0,0,0,0,0,0,0,0]
["JantoMar15Dumfries and GallowayLow or No Risk","Dumfries and Galloway","Low or No Risk","JantoMar15",0,0,0,0,0,0,0,0,0,0,0,0]
["JantoMar15Dumfries and GallowayNot available","Dumfries and Galloway","Not available","JantoMar15",0,7.0000000000000007E-2,0.25,0.23,0.45,1,0.21,0.66,0.02,0.03,7.0000000000000007E-2,1]
["JantoMar15Dumfries and GallowayTotals","Dumfries and Galloway","Totals","JantoMar15",0,7.0000000000000007E-2,0.25,0.23,0.45,1,0.21,0.66,0.02,0.03,7.0000000000000007E-2,1]
["JantoMar15Dundee CityCritical","Dundee City","Critical","JantoMar15",0.36,0.25,0.18,0.18,0.04,1,0,0.89,0.05,0.03,0.03,1]
["JantoMar15Dundee CitySubstantial","Dundee City","Substantial","JantoMar15",0.05,0.55000000000000004,0.14000000000000001,0,0.27,1,0,0.88,0.06,0,0.06,1]
["JantoMar15Dundee CityModerate","Dundee City","Moderate","JantoMar15",0.09,0.38,0.1,0.08,0.36,1,0,1,0,0,0,1]
["JantoMar15Dundee CityLow or No Risk","Dundee City","Low or No Risk","JantoMar15",0.06,0.28999999999999998,0.06,0.03,0.56999999999999995,1,0,1,0,0,0,1]
["JantoMar15Dundee CityNot available","Dundee City","Not available","JantoMar15",0,0,1,0,0,1,0,0,0,0,0,0]
["JantoMar15Dundee CityTotals","Dundee City","Totals","JantoMar15",0.1,0.37,0.11,0.08,0.35,1,0,0.9,0.05,0.02,0.03,1]
["JantoMar15East AyrshireCritical","East Ayrshire","Critical","JantoMar15",0.03,0.1,0.4,0.1,0.37,1,0.64,0.28999999999999998,7.0000000000000007E-2,0,0,1]
["JantoMar15East AyrshireSubstantial","East Ayrshire","Substantial","JantoMar15",0.05,0.06,0.12,0.09,0.68,1,0.38,0.44,0.04,0.03,0.11,1]
["JantoMar15East AyrshireModerate","East Ayrshire","Moderate","JantoMar15",0.05,0.05,0.09,0.09,0.74,1,0.41,0.43,0.01,0.09,0.06,1]
["JantoMar15East AyrshireLow or No Risk","East Ayrshire","Low or No Risk","JantoMar15",0,0,0.33,0.11,0.56000000000000005,1,0.38,0.63,0,0,0,1]
["JantoMar15East AyrshireNot available","East Ayrshire","Not available","JantoMar15",0,0,0,0,0,0,0,0,0,0,0,0]
["JantoMar15East AyrshireTotals","East Ayrshire","Totals","JantoMar15",0.04,0.06,0.14000000000000001,0.09,0.67,1,0.5,0.38,0.05,0.03,0.05,1]
["JantoMar15East DunbartonshireCritical","East Dunbartonshire","Critical","JantoMar15",0.69,0.31,0,0,0,1,0,1,0,0,0,1]
["JantoMar15East DunbartonshireSubstantial","East Dunbartonshire","Substantial","JantoMar15",0.78,0.18,0.03,0,0.01,1,0,0.94,0.04,0.02,0,1]
["JantoMar15East DunbartonshireModerate","East Dunbartonshire","Moderate","JantoMar15",0.77,0.17,0.03,0.03,0,1,0,0.89,0,7.0000000000000007E-2,0.04,1]
["JantoMar15East DunbartonshireLow or No Risk","East Dunbartonshire","Low or No Risk","JantoMar15",0.75,0.25,0,0,0,1,0,1,0,0,0,1]
["JantoMar15East DunbartonshireNot available","East Dunbartonshire","Not available","JantoMar15",0,0,0,0,0,0,0,0,0,0,0,0]
["JantoMar15East DunbartonshireTotals","East Dunbartonshire","Totals","JantoMar15",0.77,0.19,0.03,0,0,1,0,0.94,0.04,0.02,0,1]
["JantoMar15East LothianCritical","East Lothian","Critical","JantoMar15",0,0,0,0,0,0,0,0,0,0,0,0]
["JantoMar15East LothianSubstantial","East Lothian","Substantial","JantoMar15",0.19,0.18,0.15,0.2,0.28000000000000003,1,0.25,0.28999999999999998,0.33,0.12,0.01,1]
["JantoMar15East LothianModerate","East Lothian","Moderate","JantoMar15",0,0,0,0,0,0,0,0,0,0,0,0]
["JantoMar15East LothianLow or No Risk","East Lothian","Low or No Risk","JantoMar15",0,0,0,0,0,0,0,0,0,0,0,0]
["JantoMar15East LothianNot available","East Lothian","Not available","JantoMar15",0,0,0,0,0,0,0,0,0,0,0,0]
["JantoMar15East LothianTotals","East Lothian","Totals","JantoMar15",0.19,0.18,0.15,0.2,0.28000000000000003,1,0.25,0.28999999999999998,0.33,0.12,0.01,1]
["JantoMar15East RenfrewshireCritical","East Renfrewshire","Critical","JantoMar15",0,0,0,0,0,0,0,0,0,0,0,0]
["JantoMar15East RenfrewshireSubstantial","East Renfrewshire","Substantial","JantoMar15",0,0,0,0,0,0,0,0,0,0,0,0]
["JantoMar15East RenfrewshireModerate","East Renfrewshire","Moderate","JantoMar15",0,0,0,0,0,0,0,0,0,0,0,0]
["JantoMar15East RenfrewshireLow or No Risk","East Renfrewshire","Low or No Risk","JantoMar15",0,0,0,0,0,0,0,0,0,0,0,0]
[{"$f":"D2641&B2641&C2641","v":"JantoMar15East RenfrewshireNot available"},"East Renfrewshire","Not available","JantoMar15",0,0,0,0,0,0,0,0,0,0,0,0]
["JantoMar15East RenfrewshireTotals","East Renfrewshire","Totals","JantoMar15",0,0,0,0,0,0,0,0,0,0,0,0]
["JantoMar15Edinburgh, City ofCritical","Edinburgh, City of","Critical","JantoMar15",0,0,0,0,0,0,0,0,0,0,0,0]
["JantoMar15Edinburgh, City ofSubstantial","Edinburgh, City of","Substantial","JantoMar15",0,0,0,0,0,0,0,0,0,0,0,0]
["JantoMar15Edinburgh, City ofModerate","Edinburgh, City of","Moderate","JantoMar15",0,0,0,0,0,0,0,0,0,0,0,0]
["JantoMar15Edinburgh, City ofLow or No Risk","Edinburgh, City of","Low or No Risk","JantoMar15",0,0,0,0,0,0,0,0,0,0,0,0]
["JantoMar15Edinburgh, City ofNot available","Edinburgh, City of","Not available","JantoMar15",0.21,0.28000000000000003,0.21,0.11,0.2,1,0.04,0.6,0.19,0.1,7.0000000000000007E-2,1]
["JantoMar15Edinburgh, City ofTotals","Edinburgh, City of","Totals","JantoMar15",0.21,0.28000000000000003,0.21,0.11,0.2,1,0.04,0.6,0.19,0.1,7.0000000000000007E-2,1]
["JantoMar15Eilean SiarCritical","Eilean Siar","Critical","JantoMar15",0.2,0.2,0.2,0.2,0.2,1,0.2,0.4,0.2,0,0.2,1]
["JantoMar15Eilean SiarSubstantial","Eilean Siar","Substantial","JantoMar15",0,0.2,0.13,0.13,0.53,1,0.38,0.15,0.15,0.15,0.15,1]
["JantoMar15Eilean SiarModerate","Eilean Siar","Moderate","JantoMar15",0,0,0,0,1,1,0,0,0,0,0,0]
["JantoMar15Eilean SiarLow or No Risk","Eilean Siar","Low or No Risk","JantoMar15",0,0,0,0,0,0,0,0,0,0,0,0]
["JantoMar15Eilean SiarNot available","Eilean Siar","Not available","JantoMar15",0,0.28999999999999998,7.0000000000000007E-2,0.21,0.43,1,0.5,0.33,0.08,0,0.08,1]
["JantoMar15Eilean SiarTotals","Eilean Siar","Totals","JantoMar15",0.03,0.23,0.11,0.17,0.46,1,0.4,0.27,0.13,7.0000000000000007E-2,0.13,1]
["JantoMar15FalkirkCritical","Falkirk","Critical","JantoMar15",0,0,0,0,0,0,0,0,0,0,0,0]
["JantoMar15FalkirkSubstantial","Falkirk","Substantial","JantoMar15",0,0,0,0,0,0,0,0,0,0,0,0]
["JantoMar15FalkirkModerate","Falkirk","Moderate","JantoMar15",0,0,0,0,0,0,0,0,0,0,0,0]
["JantoMar15FalkirkLow or No Risk","Falkirk","Low or No Risk","JantoMar15",0,0,0,0,0,0,0,0,0,0,0,0]
["JantoMar15FalkirkNot available","Falkirk","Not available","JantoMar15",0,0,0,0,0,0,0,0,0,0,0,0]
["JantoMar15FalkirkTotals","Falkirk","Totals","JantoMar15",0,0,0,0,0,0,0,0,0,0,0,0]
["JantoMar15FifeCritical","Fife","Critical","JantoMar15",0.13,0.5,0.16,0.06,0.15,1,0.18,0.48,0.25,7.0000000000000007E-2,0.02,1]
["JantoMar15FifeSubstantial","Fife","Substantial","JantoMar15",0.03,0.22,0.13,0.1,0.53,1,0.22,0.53,0.17,0.06,0.03,1]
["JantoMar15FifeModerate","Fife","Moderate","JantoMar15",0.03,0.08,0.1,0.09,0.7,1,0.21,0.42,0.26,0.11,0,1]
["JantoMar15FifeLow or No Risk","Fife","Low or No Risk","JantoMar15",0,0.31,0.12,0.08,0.5,1,0,0.67,0.33,0,0,1]
["JantoMar15FifeNot available","Fife","Not available","JantoMar15",0.06,0.18,0.08,7.0000000000000007E-2,0.62,1,0.25,0.5,0,0.25,0,1]
["JantoMar15FifeTotals","Fife","Totals","JantoMar15",0.05,0.23,0.11,0.08,0.53,1,0.21,0.51,0.2,7.0000000000000007E-2,0.02,1]
["JantoMar15Glasgow CityCritical","Glasgow City","Critical","JantoMar15",0.14000000000000001,0.21,0.19,0.14000000000000001,0.32,1,0,0,1,0,0,1]
["JantoMar15Glasgow CitySubstantial","Glasgow City","Substantial","JantoMar15",0.05,0.35,0.15,0.06,0.39,1,0,1,0,0,0,1]
["JantoMar15Glasgow CityModerate","Glasgow City","Moderate","JantoMar15",0,0.15,0.05,0.04,0.76,1,0,1,0,0,0,1]
["JantoMar15Glasgow CityLow or No Risk","Glasgow City","Low or No Risk","JantoMar15",0,0,0,0,0,0,0,1,0,0,0,1]
["JantoMar15Glasgow CityNot available","Glasgow City","Not available","JantoMar15",0.24,0.35,0.19,0.04,0.18,1,0,1,0,0,0,1]
["JantoMar15Glasgow CityTotals","Glasgow City","Totals","JantoMar15",7.0000000000000007E-2,0.33,0.16,7.0000000000000007E-2,0.38,1,0,0.98,0.02,0,0,1]
["JantoMar15HighlandCritical","Highland","Critical","JantoMar15",0.24,0.23,0.1,0.06,0.37,1,0,0,0,0,0,0]
["JantoMar15HighlandSubstantial","Highland","Substantial","JantoMar15",0.23,0.23,0.1,0.1,0.34,1,0,0,0,0,0,0]
["JantoMar15HighlandModerate","Highland","Moderate","JantoMar15",0.04,0.11,0.13,0.11,0.61,1,0,0,0,0,0,0]
["JantoMar15HighlandLow or No Risk","Highland","Low or No Risk","JantoMar15",0.18,0.09,0.18,0,0.55000000000000004,1,0,0,0,0,0,0]
["JantoMar15HighlandNot available","Highland","Not available","JantoMar15",0.03,0.08,0.14000000000000001,0.12,0.63,1,0,0,0,0,0,0]
["JantoMar15HighlandTotals","Highland","Totals","JantoMar15",0.13,0.16,0.12,0.09,0.5,1,0,0,0,0,0,0]
["JantoMar15InverclydeCritical","Inverclyde","Critical","JantoMar15",0.13,0.13,0.25,0.25,0.25,1,0.21,0.69,0.03,0.03,0.03,1]
["JantoMar15InverclydeSubstantial","Inverclyde","Substantial","JantoMar15",0.12,0.42,0.21,0.09,0.15,1,0.2,0.6,0.08,0.08,0.04,1]
["JantoMar15InverclydeModerate","Inverclyde","Moderate","JantoMar15",0.47,0.12,0.24,0.12,0.06,1,0.36,0.55000000000000004,0,0,0.09,1]
["JantoMar15InverclydeLow or No Risk","Inverclyde","Low or No Risk","JantoMar15",0.33,0.33,0.11,0.22,0,1,1,0,0,0,0,1]
["JantoMar15InverclydeNot available","Inverclyde","Not available","JantoMar15",0.67,0,0,0,0.33,1,0,0,0,0,0,0]
["JantoMar15InverclydeTotals","Inverclyde","Totals","JantoMar15",0.26,0.28999999999999998,0.2,0.13,0.13,1,0.26,0.6,0.04,0.04,0.04,1]
["JantoMar15MidlothianCritical","Midlothian","Critical","JantoMar15",0,0,0,0,0,0,0,0,0,0,0,0]
["JantoMar15MidlothianSubstantial","Midlothian","Substantial","JantoMar15",0,0,0,0,0,0,0,0,0,0,0,0]
["JantoMar15MidlothianModerate","Midlothian","Moderate","JantoMar15",0,0,0,0,0,0,0,0,0,0,0,0]
["JantoMar15MidlothianLow or No Risk","Midlothian","Low or No Risk","JantoMar15",0,0,0,0,0,0,0,0,0,0,0,0]
["JantoMar15MidlothianNot available","Midlothian","Not available","JantoMar15",0.02,0.18,0.24,0.11,0.46,1,0,0,0,0,0,0]
["JantoMar15MidlothianTotals","Midlothian","Totals","JantoMar15",0.02,0.18,0.24,0.11,0.46,1,0,0,0,0,0,0]
["JantoMar15MorayCritical","Moray","Critical","JantoMar15",0.09,0.45,0.36,0.09,0,1,0.5,0.2,0.1,0.15,0.05,1]
["JantoMar15MoraySubstantial","Moray","Substantial","JantoMar15",0,0.32,0.3,0.22,0.16,1,0.22,0.52,0.16,0.08,0.03,1]
["JantoMar15MorayModerate","Moray","Moderate","JantoMar15",0,0,1,0,0,1,0,0.38,0.38,0.25,0,1]
["JantoMar15MorayLow or No Risk","Moray","Low or No Risk","JantoMar15",0,0,0,0,0,0,0,0,0,0,0,0]
["JantoMar15MorayNot available","Moray","Not available","JantoMar15",0,0,1,0,0,1,0,0,0,0,0,0]
["JantoMar15MorayTotals","Moray","Totals","JantoMar15",0.02,0.32,0.38,0.17,0.11,1,0.25,0.46,0.16,0.1,0.03,1]
["JantoMar15North AyrshireCritical","North Ayrshire","Critical","JantoMar15",0.28999999999999998,0.43,0.14000000000000001,0,0.14000000000000001,1,0,0,0,0,0,0]
["JantoMar15North AyrshireSubstantial","North Ayrshire","Substantial","JantoMar15",0.09,0.3,0.27,0.14000000000000001,0.2,1,0,0,0,0,0,0]
["JantoMar15North AyrshireModerate","North Ayrshire","Moderate","JantoMar15",0,0,0,0.6,0.4,1,0,0,0,0,0,0]
["JantoMar15North AyrshireLow or No Risk","North Ayrshire","Low or No Risk","JantoMar15",0,0,0,0,1,1,0,0,0,0,0,0]
["JantoMar15North AyrshireNot available","North Ayrshire","Not available","JantoMar15",0,0,1,0,0,1,0,0,0,0,0,0]
["JantoMar15North AyrshireTotals","North Ayrshire","Totals","JantoMar15",0.1,0.27,0.24,0.15,0.24,1,0,0,0,0,0,0]
["JantoMar15North LanarkshireCritical","North Lanarkshire","Critical","JantoMar15",0.32,0.24,0.11,7.0000000000000007E-2,0.27,1,0.18,0.76,0.05,0.01,0.01,1]
["JantoMar15North LanarkshireSubstantial","North Lanarkshire","Substantial","JantoMar15",0.06,0.35,0.19,0.1,0.31,1,0.3,0.63,0.06,0.01,0,1]
[{"$f":"D2705&B2705&C2705","v":"JantoMar15North LanarkshireModerate"},"North Lanarkshire","Moderate","JantoMar15",7.0000000000000007E-2,0.25,0.16,0.17,0.35,1,0.22,0.75,0.01,0,0.01,1]
["JantoMar15North LanarkshireLow or No Risk","North Lanarkshire","Low or No Risk","JantoMar15",0.05,0.32,0.18,0.05,0.39,1,0.25,0.71,0,0.04,0,1]
["JantoMar15North LanarkshireNot available","North Lanarkshire","Not available","JantoMar15",0.76,0.08,0.03,0.02,0.1,1,0.14000000000000001,0.69,0,0.06,0.12,1]
["JantoMar15North LanarkshireTotals","North Lanarkshire","Totals","JantoMar15",0.26,0.25,0.13,0.09,0.28000000000000003,1,0.21,0.72,0.04,0.01,0.02,1]
["JantoMar15Orkney islandsCritical","Orkney islands","Critical","JantoMar15",0,0,0,0,0,0,0,0,0,0,0,0]
["JantoMar15Orkney islandsSubstantial","Orkney islands","Substantial","JantoMar15",0,0,0,0,0,0,0,0,0,0,0,0]
["JantoMar15Orkney islandsModerate","Orkney islands","Moderate","JantoMar15",0,0,0,0,0,0,0,0,0,0,0,0]
["JantoMar15Orkney islandsLow or No Risk","Orkney islands","Low or No Risk","JantoMar15",0,0,0,0,0,0,0,0,0,0,0,0]
["JantoMar15Orkney islandsNot available","Orkney islands","Not available","JantoMar15",0,0,0,0,0,0,0,0,0,0,0,0]
["JantoMar15Orkney islandsTotals","Orkney islands","Totals","JantoMar15",0,0,0,0,0,0,0,0,0,0,0,0]
["JantoMar15Perth & KinrossCritical","Perth & Kinross","Critical","JantoMar15",0.33,0.67,0,0,0,1,0.13,0.49,0.15,0.05,0.18,1]
["JantoMar15Perth & KinrossSubstantial","Perth & Kinross","Substantial","JantoMar15",0.21,0.23,0.14000000000000001,0.14000000000000001,0.28000000000000003,1,0.05,0.41,0.22,0.13,0.19,1]
["JantoMar15Perth & KinrossModerate","Perth & Kinross","Moderate","JantoMar15",0.36,0.15,0.09,0.04,0.35,1,0.02,0.57999999999999996,0.17,0.11,0.13,1]
["JantoMar15Perth & KinrossLow or No Risk","Perth & Kinross","Low or No Risk","JantoMar15",0.17,0.25,0.08,0,0.5,1,0,0.44,0.22,0,0.33,1]
["JantoMar15Perth & KinrossNot available","Perth & Kinross","Not available","JantoMar15",0.12,0.32,0.2,0.12,0.24,1,0,0.5,0,0,0.5,1]
["JantoMar15Perth & KinrossTotals","Perth & Kinross","Totals","JantoMar15",0.28000000000000003,0.21,0.12,7.0000000000000007E-2,0.32,1,0.04,0.5,0.19,0.11,0.16,1]
["JantoMar15RenfrewshireCritical","Renfrewshire","Critical","JantoMar15",0.85,0.15,0,0,0,1,0.98,0.02,0,0,0,1]
["JantoMar15RenfrewshireSubstantial","Renfrewshire","Substantial","JantoMar15",0.95,0,0.05,0,0,1,0.91,0.09,0,0,0,1]
["JantoMar15RenfrewshireModerate","Renfrewshire","Moderate","JantoMar15",1,0,0,0,0,1,0.93,0,7.0000000000000007E-2,0,0,1]
["JantoMar15RenfrewshireLow or No Risk","Renfrewshire","Low or No Risk","JantoMar15",1,0,0,0,0,1,0.96,0.04,0,0,0,1]
["JantoMar15RenfrewshireNot available","Renfrewshire","Not available","JantoMar15",0.98,0,0,0,0.01,1,0.95,0.04,0,0,0,1]
["JantoMar15RenfrewshireTotals","Renfrewshire","Totals","JantoMar15",0.97,0.01,0.01,0,0.01,1,0.95,0.04,0.01,0,0,1]
["JantoMar15Scottish BordersCritical","Scottish Borders","Critical","JantoMar15",0.1,0.3,0.15,0.05,0.4,1,0.05,0.74,0.05,0.05,0.12,1]
["JantoMar15Scottish BordersSubstantial","Scottish Borders","Substantial","JantoMar15",0.02,0.06,0.08,0.1,0.73,1,0,0,0,0,1,1]
["JantoMar15Scottish BordersModerate","Scottish Borders","Moderate","JantoMar15",0,0,0,0,1,1,0,0,0,0,0,0]
["JantoMar15Scottish BordersLow or No Risk","Scottish Borders","Low or No Risk","JantoMar15",0,0.5,0,0,0.5,1,0,0,0,0,0,0]
["JantoMar15Scottish BordersNot available","Scottish Borders","Not available","JantoMar15",0,0,0,0,0,0,0,0,0,0,0,0]
["JantoMar15Scottish BordersTotals","Scottish Borders","Totals","JantoMar15",0.09,0.25,0.13,0.06,0.47,1,0.05,0.72,0.05,0.05,0.14000000000000001,1]
["JantoMar15Shetland islandsCritical","Shetland islands","Critical","JantoMar15",0.13,0.5,0.13,0.13,0.13,1,0.33,0.67,0,0,0,1]
["JantoMar15Shetland islandsSubstantial","Shetland islands","Substantial","JantoMar15",0.5,0.33,0,0,0.17,1,0.3,0.55000000000000004,0.1,0.05,0,1]
["JantoMar15Shetland islandsModerate","Shetland islands","Moderate","JantoMar15",0,1,0,0,0,1,0,0.75,0.25,0,0,1]
["JantoMar15Shetland islandsLow or No Risk","Shetland islands","Low or No Risk","JantoMar15",0,0,0,0,1,1,0,0,0,0,0,0]
["JantoMar15Shetland islandsNot available","Shetland islands","Not available","JantoMar15",0.17,0.28000000000000003,0.28000000000000003,0.08,0.19,1,0.25,0.75,0,0,0,1]
["JantoMar15Shetland islandsTotals","Shetland islands","Totals","JantoMar15",0.19,0.33,0.21,0.08,0.19,1,0.27,0.62,0.08,0.03,0,1]
["JantoMar15South AyrshireCritical","South Ayrshire","Critical","JantoMar15",0,0,0,0,0,0,0,0,0,0,0,0]
["JantoMar15South AyrshireSubstantial","South Ayrshire","Substantial","JantoMar15",0,0,0,0,0,0,0,0,0,0,0,0]
["JantoMar15South AyrshireModerate","South Ayrshire","Moderate","JantoMar15",0,0,0,0,0,0,0,0,0,0,0,0]
["JantoMar15South AyrshireLow or No Risk","South Ayrshire","Low or No Risk","JantoMar15",0,0,0,0,0,0,0,0,0,0,0,0]
["JantoMar15South AyrshireNot available","South Ayrshire","Not available","JantoMar15",0,0,0,0,0,0,0,0,0,0,0,0]
["JantoMar15South AyrshireTotals","South Ayrshire","Totals","JantoMar15",0,0,0,0,0,0,0,0,0,0,0,0]
["JantoMar15South LanarkshireCritical","South Lanarkshire","Critical","JantoMar15",0,0,0,0,0,0,0,0,0,0,0,0]
["JantoMar15South LanarkshireSubstantial","South Lanarkshire","Substantial","JantoMar15",0,0,0,0,0,0,0,0,0,0,0,0]
["JantoMar15South LanarkshireModerate","South Lanarkshire","Moderate","JantoMar15",0,0,0,0,0,0,0,0,0,0,0,0]
["JantoMar15South LanarkshireLow or No Risk","South Lanarkshire","Low or No Risk","JantoMar15",0,0,0,0,0,0,0,0,0,0,0,0]
["JantoMar15South LanarkshireNot available","South Lanarkshire","Not available","JantoMar15",0,0,0,0,0,0,0,0,0,0,0,0]
["JantoMar15South LanarkshireTotals","South Lanarkshire","Totals","JantoMar15",0,0,0,0,0,0,0,0,0,0,0,0]
["JantoMar15StirlingCritical","Stirling","Critical","JantoMar15",0.79,0.12,0.01,0.01,7.0000000000000007E-2,1,0.05,0.57999999999999996,0.31,0.02,0.04,1]
["JantoMar15StirlingSubstantial","Stirling","Substantial","JantoMar15",0.55000000000000004,0.27,0.01,0.02,0.15,1,0.13,0.47,0.2,0.2,0,1]
["JantoMar15StirlingModerate","Stirling","Moderate","JantoMar15",0.19,0.04,0,0,0.77,1,0,0,0,0,0,0]
["JantoMar15StirlingLow or No Risk","Stirling","Low or No Risk","JantoMar15",0,0,0,0,0,0,0,0,0,0,0,0]
["JantoMar15StirlingNot available","Stirling","Not available","JantoMar15",0.33,0.13,0.13,0.05,0.37,1,0.39,0.3,0.13,0.17,0,1]
["JantoMar15StirlingTotals","Stirling","Totals","JantoMar15",0.54,0.16,0.04,0.02,0.24,1,0.15,0.49,0.25,0.09,0.02,1]
["JantoMar15West DunbartonshireCritical","West Dunbartonshire","Critical","JantoMar15",0.38,0.38,0.14000000000000001,7.0000000000000007E-2,0.02,1,0,0,0,0,0,0]
["JantoMar15West DunbartonshireSubstantial","West Dunbartonshire","Substantial","JantoMar15",0.62,0.28000000000000003,0.05,0.01,0.03,1,0,0,0,0,0,0]
["JantoMar15West DunbartonshireModerate","West Dunbartonshire","Moderate","JantoMar15",0.37,0.33,0.14000000000000001,0.06,0.09,1,0,0,0,0,0,0]
["JantoMar15West DunbartonshireLow or No Risk","West Dunbartonshire","Low or No Risk","JantoMar15",0.19,0.23,0.36,0.13,0.09,1,0,0,0,0,0,0]
["JantoMar15West DunbartonshireNot available","West Dunbartonshire","Not available","JantoMar15",0,0,0,0,0,0,0,0,0,0,0,0]
["JantoMar15West DunbartonshireTotals","West Dunbartonshire","Totals","JantoMar15",0.45,0.3,0.14000000000000001,0.05,0.06,1,0,0,0,0,0,0]
["JantoMar15West LothianCritical","West Lothian","Critical","JantoMar15",0.36,0.47,0.09,0.04,0.04,1,7.0000000000000007E-2,0.43,0.28999999999999998,0.12,0.1,1]
["JantoMar15West LothianSubstantial","West Lothian","Substantial","JantoMar15",0.41,0.41,0,0.18,0,1,0.2,0.35,0.3,0.1,0.05,1]
["JantoMar15West LothianModerate","West Lothian","Moderate","JantoMar15",0.6,0.2,0,0.2,0,1,0,1,0,0,0,1]
["JantoMar15West LothianLow or No Risk","West Lothian","Low or No Risk","JantoMar15",1,0,0,0,0,1,0,0.67,0,0.33,0,1]
["JantoMar15West LothianNot available","West Lothian","Not available","JantoMar15",0,1,0,0,0,1,0,0,0,0,0,0]
["JantoMar15West LothianTotals","West Lothian","Totals","JantoMar15",0.39,0.43,0.06,0.09,0.03,1,0.1,0.43,0.27,0.12,7.0000000000000007E-2,1]
[{"$f":"D2769&B2769&C2769","v":"JantoMar15SCOTLAND TOTALSCritical"},"SCOTLAND TOTALS","Critical","JantoMar15",0.28000000000000003,0.27,0.13,0.08,0.24,1,0.3,0.51,0.13,0.03,0.03,1]
["JantoMar15SCOTLAND TOTALSSubstantial","SCOTLAND TOTALS","Substantial","JantoMar15",0.18,0.28999999999999998,0.13,0.08,0.32,1,0.2,0.57999999999999996,0.12,0.05,0.04,1]
["JantoMar15SCOTLAND TOTALSModerate","SCOTLAND TOTALS","Moderate","JantoMar15",0.17,0.2,0.12,0.09,0.43,1,0.15,0.65,0.08,0.06,0.06,1]
["JantoMar15SCOTLAND TOTALSLow or No Risk","SCOTLAND TOTALS","Low or No Risk","JantoMar15",0.26,0.19,0.15,0.06,0.34,1,0.41,0.52,0.03,0.02,0.03,1]
["JantoMar15SCOTLAND TOTALSNot available","SCOTLAND TOTALS","Not available","JantoMar15",0.25,0.19,0.18,0.11,0.28000000000000003,1,0.25,0.56999999999999995,0.08,0.05,0.05,1]
["JantoMar15SCOTLAND TOTALSTotals","SCOTLAND TOTALS","Totals","JantoMar15",0.22,0.24,0.14000000000000001,0.09,0.32,1,0.23,0.56999999999999995,0.1,0.05,0.05,1]
["JantoMar16Aberdeen CityCritical","Aberdeen City","Critical","JantoMar16",0,0,0,0,0,0,0,0,0,0,0,0]
["JantoMar16Aberdeen CitySubstantial","Aberdeen City","Substantial","JantoMar16",0.36,0.5,0.05,0.05,0.05,1,0.5,0.38,0.13,0,0,1]
["JantoMar16Aberdeen CityModerate","Aberdeen City","Moderate","JantoMar16",0.33,0.67,0,0,0,1,0,0,0,0,0,0]
["JantoMar16Aberdeen CityLow or No Risk","Aberdeen City","Low or No Risk","JantoMar16",0.2,0.6,0.2,0,0,1,0,0,0,0,0,0]
["JantoMar16Aberdeen CityNot available","Aberdeen City","Not available","JantoMar16",0.5,0.5,0,0,0,1,0,0,0,0,0,0]
["JantoMar16Aberdeen CityTotals","Aberdeen City","Totals","JantoMar16",0.38,0.52,0.05,0.02,0.02,1,0.5,0.38,0.13,0,0,1]
["JantoMar16AberdeenshireCritical","Aberdeenshire","Critical","JantoMar16",0.51,0.23,7.0000000000000007E-2,7.0000000000000007E-2,0.12,1,0.24,0.47,0.06,0.06,0.18,1]
["JantoMar16AberdeenshireSubstantial","Aberdeenshire","Substantial","JantoMar16",0.28000000000000003,0.24,0.17,7.0000000000000007E-2,0.25,1,0.24,0.56000000000000005,0.09,7.0000000000000007E-2,0.04,1]
["JantoMar16AberdeenshireModerate","Aberdeenshire","Moderate","JantoMar16",0.37,0.2,0.15,0.05,0.22,1,0,0.7,0.14000000000000001,0.03,0.14000000000000001,1]
["JantoMar16AberdeenshireLow or No Risk","Aberdeenshire","Low or No Risk","JantoMar16",0.28000000000000003,0.2,0.12,0.04,0.36,1,0.13,0.38,0.25,0,0.25,1]
["JantoMar16AberdeenshireNot available","Aberdeenshire","Not available","JantoMar16",0.6,0.26,0.05,0.04,0.05,1,0.22,0.56000000000000005,0,0.11,0.11,1]
["JantoMar16AberdeenshireTotals","Aberdeenshire","Totals","JantoMar16",0.4,0.23,0.12,0.06,0.19,1,0.16,0.57999999999999996,0.1,0.06,0.1,1]
["JantoMar16AngusCritical","Angus","Critical","JantoMar16",0,0,0.5,0.5,0,1,0,0.5,0.5,0,0,1]
["JantoMar16AngusSubstantial","Angus","Substantial","JantoMar16",0.53,0.09,0.16,0.09,0.13,1,0.09,0.63,0.09,0.09,0.09,1]
["JantoMar16AngusModerate","Angus","Moderate","JantoMar16",0.22,0.44,0,0,0.33,1,0.22,0.44,0.22,0,0.11,1]
["JantoMar16AngusLow or No Risk","Angus","Low or No Risk","JantoMar16",0.63,7.0000000000000007E-2,0.06,0.15,0.09,1,0,0.76,0.13,0.06,0.06,1]
["JantoMar16AngusNot available","Angus","Not available","JantoMar16",0,0,0,0,0,0,0,0,0,0,0,0]
["JantoMar16AngusTotals","Angus","Totals","JantoMar16",0.55000000000000004,0.11,0.09,0.12,0.12,1,0.05,0.68,0.13,0.06,7.0000000000000007E-2,1]
["JantoMar16Argyll & ButeCritical","Argyll & Bute","Critical","JantoMar16",0.43,0.3,0.09,0.09,0.09,1,0.67,0.25,0.08,0,0,1]
["JantoMar16Argyll & ButeSubstantial","Argyll & Bute","Substantial","JantoMar16",0.27,0.22,0.18,0.12,0.22,1,0.62,0.23,0.1,0.02,0.04,1]
["JantoMar16Argyll & ButeModerate","Argyll & Bute","Moderate","JantoMar16",0.44,0.15,0.22,7.0000000000000007E-2,0.11,1,0.75,0.25,0,0,0,1]
["JantoMar16Argyll & ButeLow or No Risk","Argyll & Bute","Low or No Risk","JantoMar16",0.33,0,0,0,0.67,1,1,0,0,0,0,1]
["JantoMar16Argyll & ButeNot available","Argyll & Bute","Not available","JantoMar16",0,0,0,0,0,0,0,0,0,0,0,0]
["JantoMar16Argyll & ButeTotals","Argyll & Bute","Totals","JantoMar16",0.35,0.21,0.17,0.1,0.18,1,0.65,0.24,0.08,0.01,0.02,1]
["JantoMar16ClackmannanshireCritical","Clackmannanshire","Critical","JantoMar16",0,0.5,0,0,0.5,1,0,0,0,0,0,0]
["JantoMar16ClackmannanshireSubstantial","Clackmannanshire","Substantial","JantoMar16",0.05,0.05,0.2,0.15,0.55000000000000004,1,0,0,0,0,0,0]
["JantoMar16ClackmannanshireModerate","Clackmannanshire","Moderate","JantoMar16",0,0.14000000000000001,0.18,0.14000000000000001,0.55000000000000004,1,0,0,0,0,0,0]
["JantoMar16ClackmannanshireLow or No Risk","Clackmannanshire","Low or No Risk","JantoMar16",0,0.03,0.1,0.03,0.85,1,0,0,0,0,0,0]
["JantoMar16ClackmannanshireNot available","Clackmannanshire","Not available","JantoMar16",0,0,0,0,0,0,0.62,0.34,0.03,0.01,0,1]
["JantoMar16ClackmannanshireTotals","Clackmannanshire","Totals","JantoMar16",0.01,0.08,0.14000000000000001,0.08,0.69,1,0.62,0.34,0.03,0.01,0,1]
["JantoMar16Dumfries and GallowayCritical","Dumfries and Galloway","Critical","JantoMar16",0,0,0,0,0,0,0,0,0,0,0,0]
["JantoMar16Dumfries and GallowaySubstantial","Dumfries and Galloway","Substantial","JantoMar16",0,0,0,0,0,0,0,0,0,0,0,0]
["JantoMar16Dumfries and GallowayModerate","Dumfries and Galloway","Moderate","JantoMar16",0,0,0,0,0,0,0,0,0,0,0,0]
["JantoMar16Dumfries and GallowayLow or No Risk","Dumfries and Galloway","Low or No Risk","JantoMar16",0,0,0,0,0,0,0,0,0,0,0,0]
["JantoMar16Dumfries and GallowayNot available","Dumfries and Galloway","Not available","JantoMar16",0,0.19,0.33,0.21,0.26,1,7.0000000000000007E-2,0.6,0.23,0.06,0.04,1]
["JantoMar16Dumfries and GallowayTotals","Dumfries and Galloway","Totals","JantoMar16",0,0.19,0.33,0.21,0.26,1,7.0000000000000007E-2,0.6,0.23,0.06,0.04,1]
["JantoMar16Dundee CityCritical","Dundee City","Critical","JantoMar16",0.37,0.44,0.15,0.04,0,1,0.05,0.85,0,0.05,0.05,1]
["JantoMar16Dundee CitySubstantial","Dundee City","Substantial","JantoMar16",0.17,0.33,0.2,0.17,0.13,1,0.08,0.79,0.04,0.04,0.04,1]
["JantoMar16Dundee CityModerate","Dundee City","Moderate","JantoMar16",0.15,0.38,0.16,0.17,0.15,1,0.25,0.69,0,0,0.06,1]
["JantoMar16Dundee CityLow or No Risk","Dundee City","Low or No Risk","JantoMar16",0.04,0.21,0.18,0.28999999999999998,0.28999999999999998,1,0.25,0.75,0,0,0,1]
["JantoMar16Dundee CityNot available","Dundee City","Not available","JantoMar16",0,0,0,0,0,0,0.56999999999999995,0.43,0,0,0,1]
["JantoMar16Dundee CityTotals","Dundee City","Totals","JantoMar16",0.16,0.37,0.16,0.17,0.15,1,0.17,0.75,0.01,0.03,0.04,1]
["JantoMar16East AyrshireCritical","East Ayrshire","Critical","JantoMar16",0.3,0.24,0.25,0.15,0.05,1,0.49,0.42,0.02,0.04,0.02,1]
["JantoMar16East AyrshireSubstantial","East Ayrshire","Substantial","JantoMar16",0.37,0.16,0.06,0.08,0.33,1,0.3,0.53,7.0000000000000007E-2,0.01,0.08,1]
["JantoMar16East AyrshireModerate","East Ayrshire","Moderate","JantoMar16",0.34,0.1,0.03,0.11,0.41,1,0.23,0.63,0.05,0.01,0.08,1]
["JantoMar16East AyrshireLow or No Risk","East Ayrshire","Low or No Risk","JantoMar16",0.38,0.25,0.13,0,0.25,1,0.1,0.5,0.1,0.1,0.2,1]
["JantoMar16East AyrshireNot available","East Ayrshire","Not available","JantoMar16",0,0,0,0,0,0,0,0,0,0,0,0]
["JantoMar16East AyrshireTotals","East Ayrshire","Totals","JantoMar16",0.34,0.17,0.12,0.11,0.26,1,0.35,0.51,0.05,0.03,0.06,1]
["JantoMar16East DunbartonshireCritical","East Dunbartonshire","Critical","JantoMar16",0.06,0.56000000000000005,0.39,0,0,1,0,0.93,7.0000000000000007E-2,0,0,1]
["JantoMar16East DunbartonshireSubstantial","East Dunbartonshire","Substantial","JantoMar16",0.1,0.34,0.23,0.08,0.25,1,0,0.96,0.02,0.02,0,1]
["JantoMar16East DunbartonshireModerate","East Dunbartonshire","Moderate","JantoMar16",0.14000000000000001,0.48,0.1,0.05,0.24,1,0,0.83,0.09,0.09,0,1]
["JantoMar16East DunbartonshireLow or No Risk","East Dunbartonshire","Low or No Risk","JantoMar16",0.1,0.3,0.1,0.1,0.4,1,0,1,0,0,0,1]
["JantoMar16East DunbartonshireNot available","East Dunbartonshire","Not available","JantoMar16",0,0,0,0,0,0,0,0,0,0,0,0]
["JantoMar16East DunbartonshireTotals","East Dunbartonshire","Totals","JantoMar16",0.1,0.37,0.22,7.0000000000000007E-2,0.23,1,0,0.95,0.03,0.02,0,1]
["JantoMar16East LothianCritical","East Lothian","Critical","JantoMar16",0,0,0,0,0,0,0,0,0,0,0,0]
["JantoMar16East LothianSubstantial","East Lothian","Substantial","JantoMar16",0.21,0.16,0.16,0.2,0.27,1,0.21,0.35,0.3,0.13,0.01,1]
["JantoMar16East LothianModerate","East Lothian","Moderate","JantoMar16",0,0,0,0,0,0,0,0,0,0,0,0]
["JantoMar16East LothianLow or No Risk","East Lothian","Low or No Risk","JantoMar16",0,0,0,0,0,0,0,0,0,0,0,0]
[{"$f":"D2833&B2833&C2833","v":"JantoMar16East LothianNot available"},"East Lothian","Not available","JantoMar16",0,0,0,0,0,0,0,0,0,0,0,0]
["JantoMar16East LothianTotals","East Lothian","Totals","JantoMar16",0.21,0.16,0.16,0.2,0.27,1,0.21,0.35,0.3,0.13,0.01,1]
["JantoMar16East RenfrewshireCritical","East Renfrewshire","Critical","JantoMar16",0,0,0,0,0,0,0,0,0,0,0,0]
["JantoMar16East RenfrewshireSubstantial","East Renfrewshire","Substantial","JantoMar16",0,0,0,0,0,0,0,0,0,0,0,0]
["JantoMar16East RenfrewshireModerate","East Renfrewshire","Moderate","JantoMar16",0,0,0,0,0,0,0,0,0,0,0,0]
["JantoMar16East RenfrewshireLow or No Risk","East Renfrewshire","Low or No Risk","JantoMar16",0,0,0,0,0,0,0,0,0,0,0,0]
["JantoMar16East RenfrewshireNot available","East Renfrewshire","Not available","JantoMar16",0,0,0,0,0,0,0,0,0,0,0,0]
["JantoMar16East RenfrewshireTotals","East Renfrewshire","Totals","JantoMar16",0,0,0,0,0,0,0,0,0,0,0,0]
["JantoMar16Edinburgh, City ofCritical","Edinburgh, City of","Critical","JantoMar16",0.3,0.43,0.18,0.05,0.03,1,0.08,0.57999999999999996,0.17,0.08,0.09,1]
["JantoMar16Edinburgh, City ofSubstantial","Edinburgh, City of","Substantial","JantoMar16",0.27,0.38,0.17,0.05,0.13,1,0.05,0.61,0.14000000000000001,0.08,0.13,1]
["JantoMar16Edinburgh, City ofModerate","Edinburgh, City of","Moderate","JantoMar16",0.17,0.31,0.14000000000000001,0.08,0.31,1,0,0.78,0,0,0.22,1]
["JantoMar16Edinburgh, City ofLow or No Risk","Edinburgh, City of","Low or No Risk","JantoMar16",0.36,0.14000000000000001,0.36,0,0.14000000000000001,1,0,0.33,0.33,0,0.33,1]
["JantoMar16Edinburgh, City ofNot available","Edinburgh, City of","Not available","JantoMar16",0.26,0.27,0.3,0.05,0.11,1,0.04,0.72,0.12,0.06,0.06,1]
["JantoMar16Edinburgh, City ofTotals","Edinburgh, City of","Totals","JantoMar16",0.27,0.33,0.24,0.05,0.11,1,0.05,0.65,0.14000000000000001,7.0000000000000007E-2,0.09,1]
["JantoMar16Eilean SiarCritical","Eilean Siar","Critical","JantoMar16",0,0.86,0,0,0.14000000000000001,1,0,0.86,0.14000000000000001,0,0,1]
["JantoMar16Eilean SiarSubstantial","Eilean Siar","Substantial","JantoMar16",0.5,0.17,0,0,0.33,1,0.4,0.4,0,0,0.2,1]
["JantoMar16Eilean SiarModerate","Eilean Siar","Moderate","JantoMar16",0,0,0,0,0,0,0,0,0,0,0,0]
["JantoMar16Eilean SiarLow or No Risk","Eilean Siar","Low or No Risk","JantoMar16",0,0,0,0,0,0,0,0,0,0,0,0]
["JantoMar16Eilean SiarNot available","Eilean Siar","Not available","JantoMar16",0,0,0,0,0,0,0,0,0,0,0,0]
["JantoMar16Eilean SiarTotals","Eilean Siar","Totals","JantoMar16",0.23,0.54,0,0,0.23,1,0.17,0.67,0.08,0,0.08,1]
["JantoMar16FalkirkCritical","Falkirk","Critical","JantoMar16",0,0,0,0,0,0,0,0,0,0,0,0]
["JantoMar16FalkirkSubstantial","Falkirk","Substantial","JantoMar16",0,0,0,0,0,0,0,0,0,0,0,0]
["JantoMar16FalkirkModerate","Falkirk","Moderate","JantoMar16",0,0,0,0,0,0,0,0,0,0,0,0]
["JantoMar16FalkirkLow or No Risk","Falkirk","Low or No Risk","JantoMar16",0,0,0,0,0,0,0,0,0,0,0,0]
["JantoMar16FalkirkNot available","Falkirk","Not available","JantoMar16",0,0,0,0,0,0,0,0,0,0,0,0]
["JantoMar16FalkirkTotals","Falkirk","Totals","JantoMar16",0,0,0,0,0,0,0,0,0,0,0,0]
["JantoMar16FifeCritical","Fife","Critical","JantoMar16",0.15,0.46,0.14000000000000001,7.0000000000000007E-2,0.17,1,0.11,0.52,0.34,0.03,0,1]
["JantoMar16FifeSubstantial","Fife","Substantial","JantoMar16",0.06,0.28000000000000003,0.15,0.09,0.43,1,0.17,0.48,0.23,0.08,0.04,1]
["JantoMar16FifeModerate","Fife","Moderate","JantoMar16",0.04,0.18,0.04,0.05,0.71,1,0.31,0.38,0.31,0,0,1]
["JantoMar16FifeLow or No Risk","Fife","Low or No Risk","JantoMar16",0.04,0.17,0.08,0.08,0.63,1,1,0,0,0,0,1]
["JantoMar16FifeNot available","Fife","Not available","JantoMar16",0.08,0.23,0.08,0.15,0.46,1,0.5,0.17,0.17,0.17,0,1]
["JantoMar16FifeTotals","Fife","Totals","JantoMar16",0.09,0.32,0.12,7.0000000000000007E-2,0.4,1,0.15,0.49,0.28999999999999998,0.05,0.02,1]
["JantoMar16Glasgow CityCritical","Glasgow City","Critical","JantoMar16",0.16,0.3,0.14000000000000001,0.1,0.3,1,0,1,0,0,0,1]
["JantoMar16Glasgow CitySubstantial","Glasgow City","Substantial","JantoMar16",0.12,0.39,0.09,0.04,0.37,1,0,1,0,0,0,1]
["JantoMar16Glasgow CityModerate","Glasgow City","Moderate","JantoMar16",0.17,0.09,0,0,0.74,1,0,1,0,0,0,1]
["JantoMar16Glasgow CityLow or No Risk","Glasgow City","Low or No Risk","JantoMar16",0,0,0,0,0,0,0,1,0,0,0,1]
["JantoMar16Glasgow CityNot available","Glasgow City","Not available","JantoMar16",0.42,0.21,7.0000000000000007E-2,0.03,0.27,1,0,1,0,0,0,1]
["JantoMar16Glasgow CityTotals","Glasgow City","Totals","JantoMar16",0.14000000000000001,0.36,0.09,0.05,0.36,1,0,1,0,0,0,1]
["JantoMar16HighlandCritical","Highland","Critical","JantoMar16",0.09,0.36,0.09,0.05,0.41,1,0,0,0,0,0,0]
["JantoMar16HighlandSubstantial","Highland","Substantial","JantoMar16",0.1,0.06,0.06,0.1,0.68,1,0,0,0,0,0,0]
["JantoMar16HighlandModerate","Highland","Moderate","JantoMar16",0.09,0.2,0.09,0.04,0.59,1,0,0,0,0,0,0]
["JantoMar16HighlandLow or No Risk","Highland","Low or No Risk","JantoMar16",0,0.09,0,0,0.91,1,0,0,0,0,0,0]
["JantoMar16HighlandNot available","Highland","Not available","JantoMar16",0.03,0.05,0.08,0.23,0.62,1,0,0,0,0,0,0]
["JantoMar16HighlandTotals","Highland","Totals","JantoMar16",7.0000000000000007E-2,0.18,0.08,0.09,0.59,1,0,0,0,0,0,0]
["JantoMar16InverclydeCritical","Inverclyde","Critical","JantoMar16",0.12,0.41,0.24,0.12,0.12,1,0.16,0.7,0.09,0.05,0,1]
["JantoMar16InverclydeSubstantial","Inverclyde","Substantial","JantoMar16",0.22,0.52,0.22,0.04,0,1,0.4,0.57999999999999996,0,0.03,0,1]
["JantoMar16InverclydeModerate","Inverclyde","Moderate","JantoMar16",0.41,0.47,0.06,0.06,0,1,0.47,0.47,0,0,0.05,1]
["JantoMar16InverclydeLow or No Risk","Inverclyde","Low or No Risk","JantoMar16",0.5,0.13,0,0.25,0.13,1,0.17,0.83,0,0,0,1]
["JantoMar16InverclydeNot available","Inverclyde","Not available","JantoMar16",0,0,0,0,0,0,0.75,0.25,0,0,0,1]
["JantoMar16InverclydeTotals","Inverclyde","Totals","JantoMar16",0.28000000000000003,0.43,0.15,0.09,0.05,1,0.31,0.62,0.03,0.03,0.01,1]
["JantoMar16MidlothianCritical","Midlothian","Critical","JantoMar16",7.0000000000000007E-2,0.37,0.21,0.16,0.19,1,0,0,0,0,0,0]
["JantoMar16MidlothianSubstantial","Midlothian","Substantial","JantoMar16",0.2,0.4,0.2,0,0.2,1,0,0,0,0,0,0]
["JantoMar16MidlothianModerate","Midlothian","Moderate","JantoMar16",0,0,0,0,0,0,0,0,0,0,0,0]
["JantoMar16MidlothianLow or No Risk","Midlothian","Low or No Risk","JantoMar16",0,0,0,0,0,0,0,0,0,0,0,0]
["JantoMar16MidlothianNot available","Midlothian","Not available","JantoMar16",0.11,0.22,0.39,0.12,0.15,1,0,0,0,0,0,0]
["JantoMar16MidlothianTotals","Midlothian","Totals","JantoMar16",0.1,0.27,0.34,0.13,0.16,1,0,0,0,0,0,0]
["JantoMar16MorayCritical","Moray","Critical","JantoMar16",0,0,0,0,0,0,0,0,0,0,0,0]
["JantoMar16MoraySubstantial","Moray","Substantial","JantoMar16",0,0,0,0,0,0,0,0,0,0,0,0]
["JantoMar16MorayModerate","Moray","Moderate","JantoMar16",0,0,0,0,0,0,0,0,0,0,0,0]
["JantoMar16MorayLow or No Risk","Moray","Low or No Risk","JantoMar16",0,0,0,0,0,0,0,0,0,0,0,0]
["JantoMar16MorayNot available","Moray","Not available","JantoMar16",0,0,0,0,0,0,0,0,0,0,0,0]
["JantoMar16MorayTotals","Moray","Totals","JantoMar16",0,0,0,0,0,0,0,0,0,0,0,0]
["JantoMar16North AyrshireCritical","North Ayrshire","Critical","JantoMar16",0.22,0.44,0.22,0,0.11,1,0,0,0,0,0,0]
["JantoMar16North AyrshireSubstantial","North Ayrshire","Substantial","JantoMar16",0.06,0.24,0.26,0.18,0.26,1,0,0,0,0,0,0]
[{"$f":"D2897&B2897&C2897","v":"JantoMar16North AyrshireModerate"},"North Ayrshire","Moderate","JantoMar16",0.33,0.33,0,0.33,0,1,0,0,0,0,0,0]
["JantoMar16North AyrshireLow or No Risk","North Ayrshire","Low or No Risk","JantoMar16",0,0,0,1,0,1,0,0,0,0,0,0]
["JantoMar16North AyrshireNot available","North Ayrshire","Not available","JantoMar16",0,0.75,0.25,0,0,1,0,0,0,0,0,0]
["JantoMar16North AyrshireTotals","North Ayrshire","Totals","JantoMar16",0.1,0.31,0.24,0.16,0.2,1,0,0,0,0,0,0]
["JantoMar16North LanarkshireCritical","North Lanarkshire","Critical","JantoMar16",0,0,0,0,0,0,0,0,0,0,0,0]
["JantoMar16North LanarkshireSubstantial","North Lanarkshire","Substantial","JantoMar16",0,0,0,0,0,0,0,0,0,0,0,0]
["JantoMar16North LanarkshireModerate","North Lanarkshire","Moderate","JantoMar16",0,0,0,0,0,0,0,0,0,0,0,0]
["JantoMar16North LanarkshireLow or No Risk","North Lanarkshire","Low or No Risk","JantoMar16",0,0,0,0,0,0,0,0,0,0,0,0]
["JantoMar16North LanarkshireNot available","North Lanarkshire","Not available","JantoMar16",0,0,0,0,0,0,0,0,0,0,0,0]
["JantoMar16North LanarkshireTotals","North Lanarkshire","Totals","JantoMar16",0,0,0,0,0,0,0,0,0,0,0,0]
["JantoMar16Orkney islandsCritical","Orkney islands","Critical","JantoMar16",0,0,0,0,0,0,0,0,0,0,0,0]
["JantoMar16Orkney islandsSubstantial","Orkney islands","Substantial","JantoMar16",0,0,0,0,0,0,0,0,0,0,0,0]
["JantoMar16Orkney islandsModerate","Orkney islands","Moderate","JantoMar16",0,0,0,0,0,0,0,0,0,0,0,0]
["JantoMar16Orkney islandsLow or No Risk","Orkney islands","Low or No Risk","JantoMar16",0,0,0,0,0,0,0,0,0,0,0,0]
["JantoMar16Orkney islandsNot available","Orkney islands","Not available","JantoMar16",0,0,0,0,0,0,0,0,0,0,0,0]
["JantoMar16Orkney islandsTotals","Orkney islands","Totals","JantoMar16",0,0,0,0,0,0,0,0,0,0,0,0]
["JantoMar16Perth & KinrossCritical","Perth & Kinross","Critical","JantoMar16",0.23,0.54,0,0,0.23,1,0.11,0.57999999999999996,0.16,0.09,0.06,1]
["JantoMar16Perth & KinrossSubstantial","Perth & Kinross","Substantial","JantoMar16",0.21,0.28999999999999998,0.19,0.13,0.18,1,0.06,0.59,0.15,0.1,0.09,1]
["JantoMar16Perth & KinrossModerate","Perth & Kinross","Moderate","JantoMar16",0.41,0.27,0.12,0.06,0.14000000000000001,1,0.02,0.71,0.12,0.06,0.08,1]
["JantoMar16Perth & KinrossLow or No Risk","Perth & Kinross","Low or No Risk","JantoMar16",0.2,0.2,0.1,0.1,0.4,1,0,0.56999999999999995,0.28999999999999998,0,0.14000000000000001,1]
["JantoMar16Perth & KinrossNot available","Perth & Kinross","Not available","JantoMar16",0.17,0.28000000000000003,0.14000000000000001,0.1,0.31,1,0.19,0.46,0.12,0.04,0.19,1]
["JantoMar16Perth & KinrossTotals","Perth & Kinross","Totals","JantoMar16",0.32,0.28999999999999998,0.14000000000000001,0.08,0.18,1,0.05,0.63,0.14000000000000001,0.08,0.09,1]
["JantoMar16RenfrewshireCritical","Renfrewshire","Critical","JantoMar16",0.83,0.08,0,0,0.08,1,0.33,0.57999999999999996,0.08,0,0,1]
["JantoMar16RenfrewshireSubstantial","Renfrewshire","Substantial","JantoMar16",0.61,0.17,0.09,0,0.13,1,0.43,0.33,0.1,0.14000000000000001,0,1]
["JantoMar16RenfrewshireModerate","Renfrewshire","Moderate","JantoMar16",0.38,0.31,0.08,0,0.23,1,0.44,0.11,0.11,0.33,0,1]
["JantoMar16RenfrewshireLow or No Risk","Renfrewshire","Low or No Risk","JantoMar16",0.5,0,0.3,0,0.2,1,0.94,0,0.06,0,0,1]
["JantoMar16RenfrewshireNot available","Renfrewshire","Not available","JantoMar16",0.56999999999999995,0.22,0.12,0,0.1,1,0.63,0.21,7.0000000000000007E-2,0.04,0.05,1]
["JantoMar16RenfrewshireTotals","Renfrewshire","Totals","JantoMar16",0.56999999999999995,0.21,0.11,0,0.11,1,0.61,0.23,7.0000000000000007E-2,0.05,0.04,1]
["JantoMar16Scottish BordersCritical","Scottish Borders","Critical","JantoMar16",0,0,0,0,0,0,0,0,0,0,0,0]
["JantoMar16Scottish BordersSubstantial","Scottish Borders","Substantial","JantoMar16",0,0,0,0,0,0,0,0,0,0,0,0]
["JantoMar16Scottish BordersModerate","Scottish Borders","Moderate","JantoMar16",0,0,0,0,0,0,0,0,0,0,0,0]
["JantoMar16Scottish BordersLow or No Risk","Scottish Borders","Low or No Risk","JantoMar16",0,0,0,0,0,0,0,0,0,0,0,0]
["JantoMar16Scottish BordersNot available","Scottish Borders","Not available","JantoMar16",0,0,0,0,0,0,0,0,0,0,0,0]
["JantoMar16Scottish BordersTotals","Scottish Borders","Totals","JantoMar16",0,0,0,0,0,0,0,0,0,0,0,0]
["JantoMar16Shetland islandsCritical","Shetland islands","Critical","JantoMar16",0.33,0.17,0.08,0.33,0.08,1,0.14000000000000001,0.71,0.14000000000000001,0,0,1]
["JantoMar16Shetland islandsSubstantial","Shetland islands","Substantial","JantoMar16",0.11,0.56000000000000005,0,0.11,0.22,1,0.1,0.8,0.1,0,0,1]
["JantoMar16Shetland islandsModerate","Shetland islands","Moderate","JantoMar16",1,0,0,0,0,1,0,0.25,0.75,0,0,1]
["JantoMar16Shetland islandsLow or No Risk","Shetland islands","Low or No Risk","JantoMar16",0,0,0,0,1,1,0,0,0,0,0,0]
["JantoMar16Shetland islandsNot available","Shetland islands","Not available","JantoMar16",0.2,0.17,0.2,0.22,0.22,1,0,1,0,0,0,1]
["JantoMar16Shetland islandsTotals","Shetland islands","Totals","JantoMar16",0.23,0.22,0.14000000000000001,0.22,0.2,1,7.0000000000000007E-2,0.74,0.19,0,0,1]
["JantoMar16South AyrshireCritical","South Ayrshire","Critical","JantoMar16",0,0,0,0,0,0,0,0,0,0,0,0]
["JantoMar16South AyrshireSubstantial","South Ayrshire","Substantial","JantoMar16",0,0,0,0,0,0,0,0,0,0,0,0]
["JantoMar16South AyrshireModerate","South Ayrshire","Moderate","JantoMar16",0,0,0,0,0,0,0,0,0,0,0,0]
["JantoMar16South AyrshireLow or No Risk","South Ayrshire","Low or No Risk","JantoMar16",0,0,0,0,0,0,0,0,0,0,0,0]
["JantoMar16South AyrshireNot available","South Ayrshire","Not available","JantoMar16",0,0,0,0,0,0,0,0,0,0,0,0]
["JantoMar16South AyrshireTotals","South Ayrshire","Totals","JantoMar16",0,0,0,0,0,0,0,0,0,0,0,0]
["JantoMar16South LanarkshireCritical","South Lanarkshire","Critical","JantoMar16",0,0,0,0,0,0,0,0,0,0,0,0]
["JantoMar16South LanarkshireSubstantial","South Lanarkshire","Substantial","JantoMar16",0,0,0,0,0,0,0,0,0,0,0,0]
["JantoMar16South LanarkshireModerate","South Lanarkshire","Moderate","JantoMar16",0,0,0,0,0,0,0,0,0,0,0,0]
["JantoMar16South LanarkshireLow or No Risk","South Lanarkshire","Low or No Risk","JantoMar16",0,0,0,0,0,0,0,0,0,0,0,0]
["JantoMar16South LanarkshireNot available","South Lanarkshire","Not available","JantoMar16",0,0,0,0,0,0,0,0,0,0,0,0]
["JantoMar16South LanarkshireTotals","South Lanarkshire","Totals","JantoMar16",0,0,0,0,0,0,0,0,0,0,0,0]
["JantoMar16StirlingCritical","Stirling","Critical","JantoMar16",0.82,7.0000000000000007E-2,0.02,0.03,0.06,1,0.17,0.49,0.26,0.03,0.06,1]
["JantoMar16StirlingSubstantial","Stirling","Substantial","JantoMar16",0.49,0.21,0.01,0.02,0.27,1,0.05,0.35,0.4,0.2,0,1]
["JantoMar16StirlingModerate","Stirling","Moderate","JantoMar16",0.38,0.13,0,0,0.5,1,0,0,1,0,0,1]
["JantoMar16StirlingLow or No Risk","Stirling","Low or No Risk","JantoMar16",0,0,0,0,0,0,0,0,0,0,0,0]
["JantoMar16StirlingNot available","Stirling","Not available","JantoMar16",0.48,0.05,7.0000000000000007E-2,0.05,0.36,1,0.33,0.33,0.28999999999999998,0,0.04,1]
["JantoMar16StirlingTotals","Stirling","Totals","JantoMar16",0.59,0.12,0.03,0.03,0.24,1,0.19,0.4,0.31,0.06,0.04,1]
["JantoMar16West DunbartonshireCritical","West Dunbartonshire","Critical","JantoMar16",0.65,0.35,0,0,0,1,0,0,0,0,0,0]
["JantoMar16West DunbartonshireSubstantial","West Dunbartonshire","Substantial","JantoMar16",0.7,0.14000000000000001,0.06,0.06,0.04,1,0,0,0,0,0,0]
["JantoMar16West DunbartonshireModerate","West Dunbartonshire","Moderate","JantoMar16",0.26,0.3,0.21,0.11,0.11,1,0,0,0,0,0,0]
["JantoMar16West DunbartonshireLow or No Risk","West Dunbartonshire","Low or No Risk","JantoMar16",0.34,0.27,0.2,0.13,7.0000000000000007E-2,1,0,0,0,0,0,0]
["JantoMar16West DunbartonshireNot available","West Dunbartonshire","Not available","JantoMar16",0,0,0,0,0,0,0,0,0,0,0,0]
["JantoMar16West DunbartonshireTotals","West Dunbartonshire","Totals","JantoMar16",0.56999999999999995,0.2,0.1,7.0000000000000007E-2,0.05,1,0,0,0,0,0,0]
[{"$f":"D2961&B2961&C2961","v":"JantoMar16West LothianCritical"},"West Lothian","Critical","JantoMar16",0.23,0.6,0.12,0.02,0.03,1,0.05,0.44,0.16,0.16,0.18,1]
["JantoMar16West LothianSubstantial","West Lothian","Substantial","JantoMar16",0.21,0.56999999999999995,0.15,0.02,0.06,1,0.34,0.37,0.14000000000000001,0.06,0.09,1]
["JantoMar16West LothianModerate","West Lothian","Moderate","JantoMar16",0.19,0.62,0.1,0.05,0.05,1,0.3,0.37,0.26,7.0000000000000007E-2,0,1]
["JantoMar16West LothianLow or No Risk","West Lothian","Low or No Risk","JantoMar16",0,1,0,0,0,1,0,0,0,0,0,0]
["JantoMar16West LothianNot available","West Lothian","Not available","JantoMar16",0,0,0,0,0,0,0,0,0,0,0,0]
["JantoMar16West LothianTotals","West Lothian","Totals","JantoMar16",0.21,0.6,0.13,0.02,0.04,1,0.24,0.39,0.16,0.1,0.11,1]
["JantoMar16SCOTLAND TOTALSCritical","SCOTLAND TOTALS","Critical","JantoMar16",0.27,0.37,0.14000000000000001,7.0000000000000007E-2,0.14000000000000001,1,0.18,0.54,0.17,0.05,0.05,1]
["JantoMar16SCOTLAND TOTALSSubstantial","SCOTLAND TOTALS","Substantial","JantoMar16",0.21,0.31,0.12,7.0000000000000007E-2,0.28999999999999998,1,0.14000000000000001,0.63,0.12,0.06,0.05,1]
["JantoMar16SCOTLAND TOTALSModerate","SCOTLAND TOTALS","Moderate","JantoMar16",0.23,0.26,0.11,0.08,0.32,1,0.09,0.72,0.09,0.04,0.06,1]
["JantoMar16SCOTLAND TOTALSLow or No Risk","SCOTLAND TOTALS","Low or No Risk","JantoMar16",0.27,0.16,0.13,0.1,0.33,1,0.17,0.65,0.1,0.03,0.06,1]
["JantoMar16SCOTLAND TOTALSNot available","SCOTLAND TOTALS","Not available","JantoMar16",0.27,0.22,0.23,0.09,0.19,1,0.22,0.62,0.09,0.03,0.04,1]
["JantoMar16SCOTLAND TOTALSTotals","SCOTLAND TOTALS","Totals","JantoMar16",0.24,0.28999999999999998,0.15,0.08,0.25,1,0.16,0.62,0.12,0.05,0.05,1]
["JantoMar17Aberdeen CityCritical","Aberdeen City","Critical","JantoMar17",0,0,0,0,0,0,0,0.5,0,0.5,0,1]
["JantoMar17Aberdeen CitySubstantial","Aberdeen City","Substantial","JantoMar17",0.18,0.25,0.21,0.21,0.14000000000000001,1,0.38,0.5,0.13,0,0,1]
["JantoMar17Aberdeen CityModerate","Aberdeen City","Moderate","JantoMar17",0.25,0,0.5,0.25,0,1,0,0,0,0,0,0]
["JantoMar17Aberdeen CityLow or No Risk","Aberdeen City","Low or No Risk","JantoMar17",0.28999999999999998,0.71,0,0,0,1,0,0,0,0,0,0]
["JantoMar17Aberdeen CityNot available","Aberdeen City","Not available","JantoMar17",0.47,0.47,0.06,0,0,1,0,1,0,0,0,1]
["JantoMar17Aberdeen CityTotals","Aberdeen City","Totals","JantoMar17",0.28999999999999998,0.36,0.16,0.13,7.0000000000000007E-2,1,0.25,0.57999999999999996,0.08,0.08,0,1]
["JantoMar17AberdeenshireCritical","Aberdeenshire","Critical","JantoMar17",0.39,0.3,0.21,0,0.09,1,0.43,0,0.28999999999999998,0.28999999999999998,0,1]
["JantoMar17AberdeenshireSubstantial","Aberdeenshire","Substantial","JantoMar17",0.36,0.24,0.25,0.04,0.11,1,0.24,0.43,0.24,7.0000000000000007E-2,0.02,1]
["JantoMar17AberdeenshireModerate","Aberdeenshire","Moderate","JantoMar17",0.35,0.3,0.24,0.06,0.04,1,0.04,0.68,0.12,0.04,0.12,1]
["JantoMar17AberdeenshireLow or No Risk","Aberdeenshire","Low or No Risk","JantoMar17",0.14000000000000001,0.24,0.34,0,0.28000000000000003,1,0.75,0,0.25,0,0,1]
["JantoMar17AberdeenshireNot available","Aberdeenshire","Not available","JantoMar17",0.56000000000000005,0.24,0.05,0.02,0.14000000000000001,1,0,0.64,0.18,0.09,0.09,1]
["JantoMar17AberdeenshireTotals","Aberdeenshire","Totals","JantoMar17",0.38,0.26,0.21,0.03,0.11,1,0.19,0.47,0.2,0.08,0.06,1]
["JantoMar17AngusCritical","Angus","Critical","JantoMar17",0.15,0.38,0.35,0.12,0,1,0.92,0.04,0,0.04,0,1]
["JantoMar17AngusSubstantial","Angus","Substantial","JantoMar17",0.6,0.36,0.04,0,0,1,0.96,0,0,0.04,0,1]
["JantoMar17AngusModerate","Angus","Moderate","JantoMar17",0.69,0.25,0,0.06,0,1,0.93,0,0,0,7.0000000000000007E-2,1]
["JantoMar17AngusLow or No Risk","Angus","Low or No Risk","JantoMar17",0.65,0.11,0.13,0.02,0.09,1,0,1,0,0,0,1]
["JantoMar17AngusNot available","Angus","Not available","JantoMar17",0,0,0,0,0,0,0,0,0,0,0,0]
["JantoMar17AngusTotals","Angus","Totals","JantoMar17",0.54,0.24,0.14000000000000001,0.04,0.04,1,0.7,0.27,0,0.02,0.01,1]
["JantoMar17Argyll & ButeCritical","Argyll & Bute","Critical","JantoMar17",0.36,0.39,0.18,0.04,0.04,1,0.76,0.24,0,0,0,1]
["JantoMar17Argyll & ButeSubstantial","Argyll & Bute","Substantial","JantoMar17",0.36,0.27,0.12,0.11,0.13,1,0.67,0.16,7.0000000000000007E-2,0.03,7.0000000000000007E-2,1]
["JantoMar17Argyll & ButeModerate","Argyll & Bute","Moderate","JantoMar17",0.67,0,0,0,0.33,1,0.89,0.11,0,0,0,1]
["JantoMar17Argyll & ButeLow or No Risk","Argyll & Bute","Low or No Risk","JantoMar17",0.4,0.2,0,0.2,0.2,1,0,0,0,0,0,0]
["JantoMar17Argyll & ButeNot available","Argyll & Bute","Not available","JantoMar17",0,0,0,0,0,0,0,0,0,0,0,0]
["JantoMar17Argyll & ButeTotals","Argyll & Bute","Totals","JantoMar17",0.37,0.28999999999999998,0.13,0.1,0.12,1,0.7,0.17,0.06,0.02,0.05,1]
["JantoMar17ClackmannanshireCritical","Clackmannanshire","Critical","JantoMar17",0.14000000000000001,0.28999999999999998,0,0,0.56999999999999995,1,0,0,0,0,0,0]
["JantoMar17ClackmannanshireSubstantial","Clackmannanshire","Substantial","JantoMar17",0.06,0.13,0.03,0.06,0.72,1,0,0,0,0,0,0]
["JantoMar17ClackmannanshireModerate","Clackmannanshire","Moderate","JantoMar17",0,0.11,0.05,0.11,0.74,1,0,0,0,0,0,0]
["JantoMar17ClackmannanshireLow or No Risk","Clackmannanshire","Low or No Risk","JantoMar17",0,0,0.11,0,0.89,1,0,0,0,0,0,0]
["JantoMar17ClackmannanshireNot available","Clackmannanshire","Not available","JantoMar17",0,0,0,0,0,0,0.71,0.25,0.01,0.03,0,1]
["JantoMar17ClackmannanshireTotals","Clackmannanshire","Totals","JantoMar17",0.03,7.0000000000000007E-2,7.0000000000000007E-2,0.04,0.79,1,0.71,0.25,0.01,0.03,0,1]
["JantoMar17Dumfries and GallowayCritical","Dumfries and Galloway","Critical","JantoMar17",0,0.23,0.17,0.15,0.45,1,0,0.52,0.3,0.08,0.1,1]
["JantoMar17Dumfries and GallowaySubstantial","Dumfries and Galloway","Substantial","JantoMar17",0.02,0.2,0.24,0.12,0.41,1,0,0.56999999999999995,0.23,0.09,0.11,1]
["JantoMar17Dumfries and GallowayModerate","Dumfries and Galloway","Moderate","JantoMar17",0,0.28999999999999998,0.36,0.14000000000000001,0.21,1,0,0.69,0.15,0.08,0.08,1]
["JantoMar17Dumfries and GallowayLow or No Risk","Dumfries and Galloway","Low or No Risk","JantoMar17",0,0.1,0.3,0.3,0.3,1,0,0.6,0.2,0.2,0,1]
["JantoMar17Dumfries and GallowayNot available","Dumfries and Galloway","Not available","JantoMar17",0.02,0.27,0.22,0.24,0.25,1,0,0.46,0.25,0.08,0.21,1]
["JantoMar17Dumfries and GallowayTotals","Dumfries and Galloway","Totals","JantoMar17",0.01,0.23,0.22,0.17,0.37,1,0,0.53,0.27,0.09,0.11,1]
["JantoMar17Dundee CityCritical","Dundee City","Critical","JantoMar17",0,0,0,0,0,0,0,0,0,0,0,0]
["JantoMar17Dundee CitySubstantial","Dundee City","Substantial","JantoMar17",0,0,0,0,0,0,0,0,0,0,0,0]
["JantoMar17Dundee CityModerate","Dundee City","Moderate","JantoMar17",0,0,0,0,0,0,0,0,0,0,0,0]
["JantoMar17Dundee CityLow or No Risk","Dundee City","Low or No Risk","JantoMar17",0,0,0,0,0,0,0,0,0,0,0,0]
["JantoMar17Dundee CityNot available","Dundee City","Not available","JantoMar17",0.33,0.26,0.21,0.08,0.11,1,0,0.83,0.09,0.04,0.05,1]
["JantoMar17Dundee CityTotals","Dundee City","Totals","JantoMar17",0.33,0.26,0.21,0.08,0.11,1,0,0.83,0.09,0.04,0.05,1]
["JantoMar17East AyrshireCritical","East Ayrshire","Critical","JantoMar17",0.34,0.18,0.11,0.28999999999999998,0.08,1,0.38,0.55000000000000004,0.03,0.01,0.02,1]
["JantoMar17East AyrshireSubstantial","East Ayrshire","Substantial","JantoMar17",0.25,0.13,0.28000000000000003,0.13,0.23,1,0.42,0.4,7.0000000000000007E-2,0,0.12,1]
["JantoMar17East AyrshireModerate","East Ayrshire","Moderate","JantoMar17",0.22,0.2,0.13,0.04,0.42,1,0.32,0.53,0.06,0.02,7.0000000000000007E-2,1]
["JantoMar17East AyrshireLow or No Risk","East Ayrshire","Low or No Risk","JantoMar17",0.12,0.12,0.12,0,0.65,1,0.7,0.3,0,0,0,1]
["JantoMar17East AyrshireNot available","East Ayrshire","Not available","JantoMar17",0,0,0,0,0,0,0,0,0,0,0,0]
["JantoMar17East AyrshireTotals","East Ayrshire","Totals","JantoMar17",0.27,0.18,0.14000000000000001,0.15,0.26,1,0.38,0.52,0.04,0.01,0.05,1]
["JantoMar17East DunbartonshireCritical","East Dunbartonshire","Critical","JantoMar17",7.0000000000000007E-2,0.64,0.14000000000000001,7.0000000000000007E-2,7.0000000000000007E-2,1,0,1,0,0,0,1]
["JantoMar17East DunbartonshireSubstantial","East Dunbartonshire","Substantial","JantoMar17",0.16,0.33,0.16,0.1,0.26,1,0,0.95,0.02,0.02,0.01,1]
["JantoMar17East DunbartonshireModerate","East Dunbartonshire","Moderate","JantoMar17",0.39,0.17,0.08,0.03,0.33,1,0,0.89,0.05,0,0.05,1]
["JantoMar17East DunbartonshireLow or No Risk","East Dunbartonshire","Low or No Risk","JantoMar17",0.4,0.2,0,0,0.4,1,0,1,0,0,0,1]
[{"$f":"D3025&B3025&C3025","v":"JantoMar17East DunbartonshireNot available"},"East Dunbartonshire","Not available","JantoMar17",0.53,0.32,0,0,0.16,1,0,0,0,0,0,0]
["JantoMar17East DunbartonshireTotals","East Dunbartonshire","Totals","JantoMar17",0.23,0.32,0.13,7.0000000000000007E-2,0.26,1,0,0.95,0.03,0.02,0.01,1]
["JantoMar17East LothianCritical","East Lothian","Critical","JantoMar17",0,0,0,0,0,0,0,0,0,0,0,0]
["JantoMar17East LothianSubstantial","East Lothian","Substantial","JantoMar17",0.21,0.15,0.18,0.21,0.24,1,0.21,0.35,0.28999999999999998,0.14000000000000001,0.01,1]
["JantoMar17East LothianModerate","East Lothian","Moderate","JantoMar17",0,0,0,0,0,0,0,0,0,0,0,0]
["JantoMar17East LothianLow or No Risk","East Lothian","Low or No Risk","JantoMar17",0,0,0,0,0,0,0,0,0,0,0,0]
["JantoMar17East LothianNot available","East Lothian","Not available","JantoMar17",0,0,0,0,0,0,0,0,0,0,0,0]
["JantoMar17East LothianTotals","East Lothian","Totals","JantoMar17",0.21,0.15,0.18,0.21,0.24,1,0.21,0.35,0.28999999999999998,0.14000000000000001,0.01,1]
["JantoMar17East RenfrewshireCritical","East Renfrewshire","Critical","JantoMar17",0,0,0,0,0,0,0,0,0,0,0,0]
["JantoMar17East RenfrewshireSubstantial","East Renfrewshire","Substantial","JantoMar17",0,0,0,0,0,0,0,0,0,0,0,0]
["JantoMar17East RenfrewshireModerate","East Renfrewshire","Moderate","JantoMar17",0,0,0,0,0,0,0,0,0,0,0,0]
["JantoMar17East RenfrewshireLow or No Risk","East Renfrewshire","Low or No Risk","JantoMar17",0,0,0,0,0,0,0,0,0,0,0,0]
["JantoMar17East RenfrewshireNot available","East Renfrewshire","Not available","JantoMar17",0,0,0,0,0,0,0,0,0,0,0,0]
["JantoMar17East RenfrewshireTotals","East Renfrewshire","Totals","JantoMar17",0,0,0,0,0,0,0,0,0,0,0,0]
["JantoMar17Edinburgh, City ofCritical","Edinburgh, City of","Critical","JantoMar17",0.38,0.39,0.15,0.03,0.05,1,0.02,0.49,0.18,0.18,0.13,1]
["JantoMar17Edinburgh, City ofSubstantial","Edinburgh, City of","Substantial","JantoMar17",0.2,0.42,0.21,7.0000000000000007E-2,0.1,1,0.03,0.49,0.21,0.16,0.11,1]
["JantoMar17Edinburgh, City ofModerate","Edinburgh, City of","Moderate","JantoMar17",0.17,0.43,0.35,0.04,0,1,0,0.91,0,0.09,0,1]
["JantoMar17Edinburgh, City ofLow or No Risk","Edinburgh, City of","Low or No Risk","JantoMar17",0.11,0.78,0,0.11,0,1,0,1,0,0,0,1]
["JantoMar17Edinburgh, City ofNot available","Edinburgh, City of","Not available","JantoMar17",0.26,0.24,0.32,0.1,0.09,1,0.06,0.66,0.18,0.06,0.05,1]
["JantoMar17Edinburgh, City ofTotals","Edinburgh, City of","Totals","JantoMar17",0.26,0.33,0.25,0.08,0.08,1,0.04,0.56000000000000005,0.19,0.13,0.09,1]
["JantoMar17Eilean SiarCritical","Eilean Siar","Critical","JantoMar17",0.2,0.8,0,0,0,1,0.2,0.6,0.2,0,0,1]
["JantoMar17Eilean SiarSubstantial","Eilean Siar","Substantial","JantoMar17",0,0.25,0.75,0,0,1,0,0.5,0.25,0.25,0,1]
["JantoMar17Eilean SiarModerate","Eilean Siar","Moderate","JantoMar17",0,0,0,0,0,0,0,0,0,0,0,0]
["JantoMar17Eilean SiarLow or No Risk","Eilean Siar","Low or No Risk","JantoMar17",0,0,0,0,0,0,0,0,0,0,0,0]
["JantoMar17Eilean SiarNot available","Eilean Siar","Not available","JantoMar17",0,0,0,0,0,0,0,0,0,0,0,0]
["JantoMar17Eilean SiarTotals","Eilean Siar","Totals","JantoMar17",0.11,0.56000000000000005,0.33,0,0,1,0.11,0.56000000000000005,0.22,0.11,0,1]
["JantoMar17FalkirkCritical","Falkirk","Critical","JantoMar17",0.11,0.3,0.24,0.02,0.33,1,0.82,0.17,0.01,0,0,1]
["JantoMar17FalkirkSubstantial","Falkirk","Substantial","JantoMar17",0.03,0.19,0.14000000000000001,0.02,0.63,1,0.97,0.03,0,0,0,1]
["JantoMar17FalkirkModerate","Falkirk","Moderate","JantoMar17",7.0000000000000007E-2,0.55000000000000004,0.21,0.05,0.12,1,1,0,0,0,0,1]
["JantoMar17FalkirkLow or No Risk","Falkirk","Low or No Risk","JantoMar17",0.2,0.4,0,0,0.4,1,0,0,0,0,0,0]
["JantoMar17FalkirkNot available","Falkirk","Not available","JantoMar17",0.04,0.08,0.05,0.08,0.74,1,0,0,0,0,0,0]
["JantoMar17FalkirkTotals","Falkirk","Totals","JantoMar17",0.05,0.24,0.14000000000000001,0.04,0.53,1,0.89,0.11,0.01,0,0,1]
["JantoMar17FifeCritical","Fife","Critical","JantoMar17",0.17,0.54,0.18,7.0000000000000007E-2,0.04,1,0.09,0.59,0.23,0.09,0,1]
["JantoMar17FifeSubstantial","Fife","Substantial","JantoMar17",0.16,0.25,0.09,0.12,0.37,1,0.15,0.55000000000000004,0.17,0.11,0.01,1]
["JantoMar17FifeModerate","Fife","Moderate","JantoMar17",0.06,0.11,0.02,0.09,0.71,1,0.06,0.56000000000000005,0.17,0.06,0.17,1]
["JantoMar17FifeLow or No Risk","Fife","Low or No Risk","JantoMar17",0.14000000000000001,0.24,0,0,0.62,1,0.4,0.6,0,0,0,1]
["JantoMar17FifeNot available","Fife","Not available","JantoMar17",0,0.33,0.5,0.17,0,1,0.17,0.33,0.5,0,0,1]
["JantoMar17FifeTotals","Fife","Totals","JantoMar17",0.15,0.39,0.13,0.09,0.24,1,0.11,0.56999999999999995,0.21,0.09,0.01,1]
["JantoMar17Glasgow CityCritical","Glasgow City","Critical","JantoMar17",0.16,0.34,0.2,0.1,0.21,1,0,1,0,0,0,1]
["JantoMar17Glasgow CitySubstantial","Glasgow City","Substantial","JantoMar17",0.14000000000000001,0.37,0.13,0.04,0.31,1,0,1,0,0,0,1]
["JantoMar17Glasgow CityModerate","Glasgow City","Moderate","JantoMar17",0.08,0.28999999999999998,0.02,0.08,0.53,1,0,1,0,0,0,1]
["JantoMar17Glasgow CityLow or No Risk","Glasgow City","Low or No Risk","JantoMar17",0,0,0,0,0,0,0,1,0,0,0,1]
["JantoMar17Glasgow CityNot available","Glasgow City","Not available","JantoMar17",0.15,0.71,0.1,0.01,0.03,1,0,1,0,0,0,1]
["JantoMar17Glasgow CityTotals","Glasgow City","Totals","JantoMar17",0.14000000000000001,0.39,0.14000000000000001,0.05,0.28000000000000003,1,0,1,0,0,0,1]
["JantoMar17HighlandCritical","Highland","Critical","JantoMar17",0,0.28999999999999998,0.28999999999999998,7.0000000000000007E-2,0.36,1,0,0,0,0,0,0]
["JantoMar17HighlandSubstantial","Highland","Substantial","JantoMar17",0.33,0.17,0,0.17,0.33,1,0,0,0,0,0,0]
["JantoMar17HighlandModerate","Highland","Moderate","JantoMar17",0.14000000000000001,0.28999999999999998,7.0000000000000007E-2,7.0000000000000007E-2,0.43,1,0,0,0,0,0,0]
["JantoMar17HighlandLow or No Risk","Highland","Low or No Risk","JantoMar17",0,0,0,0,0,0,0,0,0,0,0,0]
["JantoMar17HighlandNot available","Highland","Not available","JantoMar17",0,0.1,0.2,0.1,0.6,1,0,0,0,0,0,0]
["JantoMar17HighlandTotals","Highland","Totals","JantoMar17",0.09,0.23,0.16,0.09,0.43,1,0,0,0,0,0,0]
["JantoMar17InverclydeCritical","Inverclyde","Critical","JantoMar17",0.28000000000000003,0.39,0.28000000000000003,0.06,0,1,0.31,0.61,0.08,0,0,1]
["JantoMar17InverclydeSubstantial","Inverclyde","Substantial","JantoMar17",0.42,0.17,0.33,0.08,0,1,0.35,0.65,0,0,0,1]
["JantoMar17InverclydeModerate","Inverclyde","Moderate","JantoMar17",0.35,0.5,0.1,0.05,0,1,0.32,0.68,0,0,0,1]
["JantoMar17InverclydeLow or No Risk","Inverclyde","Low or No Risk","JantoMar17",0.13,0.69,0.13,0,0.06,1,0.2,0.6,0,0.13,7.0000000000000007E-2,1]
["JantoMar17InverclydeNot available","Inverclyde","Not available","JantoMar17",0,0,0,0,0,0,1,0,0,0,0,1]
["JantoMar17InverclydeTotals","Inverclyde","Totals","JantoMar17",0.28999999999999998,0.45,0.2,0.05,0.02,1,0.32,0.62,0.03,0.02,0.01,1]
["JantoMar17MidlothianCritical","Midlothian","Critical","JantoMar17",0.14000000000000001,0.71,0,0,0.14000000000000001,1,0.44,0.25,0.06,0.13,0.13,1]
["JantoMar17MidlothianSubstantial","Midlothian","Substantial","JantoMar17",0,0,0,0,0,0,0,1,0,0,0,1]
["JantoMar17MidlothianModerate","Midlothian","Moderate","JantoMar17",0,0,0,0,0,0,0,1,0,0,0,1]
["JantoMar17MidlothianLow or No Risk","Midlothian","Low or No Risk","JantoMar17",0,0,0,0,0,0,0,0,0,0,0,0]
["JantoMar17MidlothianNot available","Midlothian","Not available","JantoMar17",0.04,0.14000000000000001,0.17,0.1,0.54,1,0.31,0.41,0.06,0.02,0.2,1]
["JantoMar17MidlothianTotals","Midlothian","Totals","JantoMar17",0.05,0.17,0.16,0.1,0.52,1,0.32,0.39,0.06,0.04,0.18,1]
["JantoMar17MorayCritical","Moray","Critical","JantoMar17",0,0.63,0,0.13,0.25,1,0.5,0.17,0,0.33,0,1]
["JantoMar17MoraySubstantial","Moray","Substantial","JantoMar17",0.21,0.37,0.19,0.09,0.14000000000000001,1,0.41,0.06,7.0000000000000007E-2,0.04,0.41,1]
[{"$f":"D3089&B3089&C3089","v":"JantoMar17MorayModerate"},"Moray","Moderate","JantoMar17",7.0000000000000007E-2,0.25,0.46,0.11,0.11,1,0.28000000000000003,0.24,0.12,0,0.36,1]
["JantoMar17MorayLow or No Risk","Moray","Low or No Risk","JantoMar17",0,0.36,0.32,0.12,0.2,1,0.5,0,0,0,0.5,1]
["JantoMar17MorayNot available","Moray","Not available","JantoMar17",0,0,0,0,1,1,0.33,0.33,0.33,0,0,1]
["JantoMar17MorayTotals","Moray","Totals","JantoMar17",0.1,0.35,0.28000000000000003,0.1,0.16,1,0.4,0.11,0.08,0.06,0.36,1]
["JantoMar17North AyrshireCritical","North Ayrshire","Critical","JantoMar17",0.22,0.11,0.22,0.11,0.33,1,0,0,0,0,0,0]
["JantoMar17North AyrshireSubstantial","North Ayrshire","Substantial","JantoMar17",0.06,0.31,0.19,0.06,0.38,1,0,0,0,0,0,0]
["JantoMar17North AyrshireModerate","North Ayrshire","Moderate","JantoMar17",0,0,0,0,0,0,0,0,0,0,0,0]
["JantoMar17North AyrshireLow or No Risk","North Ayrshire","Low or No Risk","JantoMar17",0,0,1,0,0,1,0,0,0,0,0,0]
["JantoMar17North AyrshireNot available","North Ayrshire","Not available","JantoMar17",0.5,0.5,0,0,0,1,0,0,0,0,0,0]
["JantoMar17North AyrshireTotals","North Ayrshire","Totals","JantoMar17",0.11,0.27,0.2,7.0000000000000007E-2,0.34,1,0,0,0,0,0,0]
["JantoMar17North LanarkshireCritical","North Lanarkshire","Critical","JantoMar17",0.27,0.28999999999999998,0.16,7.0000000000000007E-2,0.22,1,0.21,0.71,0.05,0.02,0.01,1]
["JantoMar17North LanarkshireSubstantial","North Lanarkshire","Substantial","JantoMar17",0.05,0.33,0.14000000000000001,7.0000000000000007E-2,0.41,1,0.27,0.7,0.02,0.01,0,1]
["JantoMar17North LanarkshireModerate","North Lanarkshire","Moderate","JantoMar17",0.03,0.3,0.09,0.06,0.51,1,0.31,0.63,0.06,0,0,1]
["JantoMar17North LanarkshireLow or No Risk","North Lanarkshire","Low or No Risk","JantoMar17",0,0.52,0.32,0.03,0.13,1,0,1,0,0,0,1]
["JantoMar17North LanarkshireNot available","North Lanarkshire","Not available","JantoMar17",0.75,7.0000000000000007E-2,0.03,0.01,0.14000000000000001,1,0.08,0.68,0.14000000000000001,0.08,0.03,1]
["JantoMar17North LanarkshireTotals","North Lanarkshire","Totals","JantoMar17",0.28999999999999998,0.26,0.12,0.05,0.28000000000000003,1,0.21,0.7,0.05,0.02,0.01,1]
["JantoMar17Orkney islandsCritical","Orkney islands","Critical","JantoMar17",0,0,0,0,0,0,0,0,0,0,0,0]
["JantoMar17Orkney islandsSubstantial","Orkney islands","Substantial","JantoMar17",0,0,0,0,0,0,0,0,0,0,0,0]
["JantoMar17Orkney islandsModerate","Orkney islands","Moderate","JantoMar17",0,0,0,0,0,0,0,0,0,0,0,0]
["JantoMar17Orkney islandsLow or No Risk","Orkney islands","Low or No Risk","JantoMar17",0,0,0,0,0,0,0,0,0,0,0,0]
["JantoMar17Orkney islandsNot available","Orkney islands","Not available","JantoMar17",0,0,0,0,0,0,0,0,0,0,0,0]
["JantoMar17Orkney islandsTotals","Orkney islands","Totals","JantoMar17",0,0,0,0,0,0,0,0,0,0,0,0]
["JantoMar17Perth & KinrossCritical","Perth & Kinross","Critical","JantoMar17",0.2,0.4,0.2,0.2,0,1,7.0000000000000007E-2,0.57999999999999996,0.23,7.0000000000000007E-2,0.05,1]
["JantoMar17Perth & KinrossSubstantial","Perth & Kinross","Substantial","JantoMar17",0.38,0.23,0.13,0.06,0.2,1,0.06,0.57999999999999996,0.21,0.09,0.06,1]
["JantoMar17Perth & KinrossModerate","Perth & Kinross","Moderate","JantoMar17",0.26,0.28000000000000003,0.16,0.09,0.22,1,7.0000000000000007E-2,0.45,0.27,0.1,0.11,1]
["JantoMar17Perth & KinrossLow or No Risk","Perth & Kinross","Low or No Risk","JantoMar17",0.13,0.13,0,0,0.75,1,0,0.33,0.5,0,0.17,1]
["JantoMar17Perth & KinrossNot available","Perth & Kinross","Not available","JantoMar17",0.41,0.22,0.1,0.08,0.18,1,0,0.64,0.21,0.08,7.0000000000000007E-2,1]
["JantoMar17Perth & KinrossTotals","Perth & Kinross","Totals","JantoMar17",0.31,0.26,0.14000000000000001,0.08,0.22,1,0.04,0.56000000000000005,0.23,0.09,0.08,1]
["JantoMar17RenfrewshireCritical","Renfrewshire","Critical","JantoMar17",1,0,0,0,0,1,0.45,0.35,0.15,0,0.05,1]
["JantoMar17RenfrewshireSubstantial","Renfrewshire","Substantial","JantoMar17",1,0,0,0,0,1,0.55000000000000004,0.18,0.11,0.1,0.06,1]
["JantoMar17RenfrewshireModerate","Renfrewshire","Moderate","JantoMar17",1,0,0,0,0,1,0.92,0,0,0,0.08,1]
["JantoMar17RenfrewshireLow or No Risk","Renfrewshire","Low or No Risk","JantoMar17",1,0,0,0,0,1,0.75,0.25,0,0,0,1]
["JantoMar17RenfrewshireNot available","Renfrewshire","Not available","JantoMar17",1,0,0,0,0,1,0.6,0.26,0.08,0.03,0.03,1]
["JantoMar17RenfrewshireTotals","Renfrewshire","Totals","JantoMar17",1,0,0,0,0,1,0.57999999999999996,0.24,0.09,0.05,0.04,1]
["JantoMar17Scottish BordersCritical","Scottish Borders","Critical","JantoMar17",0.26,0.22,0.06,0.1,0.36,1,0.1,0.74,0.09,0.05,0.01,1]
["JantoMar17Scottish BordersSubstantial","Scottish Borders","Substantial","JantoMar17",0.36,0.21,0,7.0000000000000007E-2,0.36,1,0.11,0.89,0,0,0,1]
["JantoMar17Scottish BordersModerate","Scottish Borders","Moderate","JantoMar17",0.38,0.13,0,0.25,0.25,1,0,0,0,0,0,0]
["JantoMar17Scottish BordersLow or No Risk","Scottish Borders","Low or No Risk","JantoMar17",0.53,0.16,0,0.03,0.28999999999999998,1,0,1,0,0,0,1]
["JantoMar17Scottish BordersNot available","Scottish Borders","Not available","JantoMar17",0,0,0,0,0,0,0,0,0,0,0,0]
["JantoMar17Scottish BordersTotals","Scottish Borders","Totals","JantoMar17",0.32,0.2,0.04,0.09,0.34,1,0.1,0.76,0.08,0.05,0.01,1]
["JantoMar17Shetland islandsCritical","Shetland islands","Critical","JantoMar17",0.33,0.33,0,0,0.33,1,0,0.75,0.25,0,0,1]
["JantoMar17Shetland islandsSubstantial","Shetland islands","Substantial","JantoMar17",0.36,0.27,0.09,0,0.27,1,0,0.8,0.2,0,0,1]
["JantoMar17Shetland islandsModerate","Shetland islands","Moderate","JantoMar17",0,0,0,0,0,0,0,1,0,0,0,1]
["JantoMar17Shetland islandsLow or No Risk","Shetland islands","Low or No Risk","JantoMar17",0,0,0,0,1,1,0,0,0,0,0,0]
["JantoMar17Shetland islandsNot available","Shetland islands","Not available","JantoMar17",0.27,0.25,0.21,7.0000000000000007E-2,0.2,1,0.13,0.88,0,0,0,1]
["JantoMar17Shetland islandsTotals","Shetland islands","Totals","JantoMar17",0.28000000000000003,0.25,0.18,0.06,0.23,1,0.04,0.83,0.13,0,0,1]
["JantoMar17South AyrshireCritical","South Ayrshire","Critical","JantoMar17",0,0,0,0,0,0,0,0,0,0,0,0]
["JantoMar17South AyrshireSubstantial","South Ayrshire","Substantial","JantoMar17",0,0,0,0,0,0,0,0,0,0,0,0]
["JantoMar17South AyrshireModerate","South Ayrshire","Moderate","JantoMar17",0,0,0,0,0,0,0,0,0,0,0,0]
["JantoMar17South AyrshireLow or No Risk","South Ayrshire","Low or No Risk","JantoMar17",0,0,0,0,0,0,0,0,0,0,0,0]
["JantoMar17South AyrshireNot available","South Ayrshire","Not available","JantoMar17",0,0,0,0,0,0,0,0,0,0,0,0]
["JantoMar17South AyrshireTotals","South Ayrshire","Totals","JantoMar17",0,0,0,0,0,0,0,0,0,0,0,0]
["JantoMar17South LanarkshireCritical","South Lanarkshire","Critical","JantoMar17",0,0,0,0,0,0,0,0,0,0,0,0]
["JantoMar17South LanarkshireSubstantial","South Lanarkshire","Substantial","JantoMar17",0,0,0,0,0,0,0,0,0,0,0,0]
["JantoMar17South LanarkshireModerate","South Lanarkshire","Moderate","JantoMar17",0,0,0,0,0,0,0,0,0,0,0,0]
["JantoMar17South LanarkshireLow or No Risk","South Lanarkshire","Low or No Risk","JantoMar17",0,0,0,0,0,0,0,0,0,0,0,0]
["JantoMar17South LanarkshireNot available","South Lanarkshire","Not available","JantoMar17",0,0,0,0,0,0,0,0,0,0,0,0]
["JantoMar17South LanarkshireTotals","South Lanarkshire","Totals","JantoMar17",0,0,0,0,0,0,0,0,0,0,0,0]
["JantoMar17StirlingCritical","Stirling","Critical","JantoMar17",0.75,0.11,0.01,0.01,0.12,1,0.17,0.5,0.21,0.12,0,1]
["JantoMar17StirlingSubstantial","Stirling","Substantial","JantoMar17",0.68,0.19,0.01,0,0.12,1,0.05,0.19,0.33,0.33,0.1,1]
["JantoMar17StirlingModerate","Stirling","Moderate","JantoMar17",0.67,0,0,0,0.33,1,0.5,0.5,0,0,0,1]
["JantoMar17StirlingLow or No Risk","Stirling","Low or No Risk","JantoMar17",0,0,0,0,0,0,0,0,0,0,0,0]
["JantoMar17StirlingNot available","Stirling","Not available","JantoMar17",0.56000000000000005,7.0000000000000007E-2,0.06,7.0000000000000007E-2,0.24,1,0.32,0.36,0.16,0.16,0,1]
["JantoMar17StirlingTotals","Stirling","Totals","JantoMar17",0.67,0.14000000000000001,0.02,0.02,0.15,1,0.19,0.39,0.22,0.18,0.02,1]
[{"$f":"D3153&B3153&C3153","v":"JantoMar17West DunbartonshireCritical"},"West Dunbartonshire","Critical","JantoMar17",0.42,0.33,0.25,0,0,1,0.95,0.05,0,0,0,1]
["JantoMar17West DunbartonshireSubstantial","West Dunbartonshire","Substantial","JantoMar17",0.89,0.09,0.02,0,0,1,1,0,0,0,0,1]
["JantoMar17West DunbartonshireModerate","West Dunbartonshire","Moderate","JantoMar17",0.44,0.33,0.11,7.0000000000000007E-2,0.05,1,0.87,0.12,0.01,0,0,1]
["JantoMar17West DunbartonshireLow or No Risk","West Dunbartonshire","Low or No Risk","JantoMar17",0.38,0.34,0.19,0.06,0.03,1,1,0,0,0,0,1]
["JantoMar17West DunbartonshireNot available","West Dunbartonshire","Not available","JantoMar17",0,0,0,0,0,0,0,0,0,0,0,0]
["JantoMar17West DunbartonshireTotals","West Dunbartonshire","Totals","JantoMar17",0.75,0.16,0.06,0.02,0.01,1,0.93,0.06,0,0,0,1]
["JantoMar17West LothianCritical","West Lothian","Critical","JantoMar17",0.28999999999999998,0.57999999999999996,0.05,0.02,0.05,1,7.0000000000000007E-2,0.21,0.16,0.09,0.47,1]
["JantoMar17West LothianSubstantial","West Lothian","Substantial","JantoMar17",0.2,0.52,0.11,0.09,0.09,1,0.14000000000000001,0.17,0.31,0,0.38,1]
["JantoMar17West LothianModerate","West Lothian","Moderate","JantoMar17",0.4,0.48,0.04,0,0.08,1,0.06,0.44,0.44,0.06,0,1]
["JantoMar17West LothianLow or No Risk","West Lothian","Low or No Risk","JantoMar17",0.32,0.64,0.05,0,0,1,0,0.33,0.17,0.5,0,1]
["JantoMar17West LothianNot available","West Lothian","Not available","JantoMar17",0,0,0,0,0,0,0.1,0.24,0.21,0.1,0.34,1]
["JantoMar17West LothianTotals","West Lothian","Totals","JantoMar17",0.28999999999999998,0.56000000000000005,0.06,0.03,0.06,1,0.09,0.25,0.24,0.09,0.33,1]
["JantoMar17SCOTLAND TOTALSCritical","SCOTLAND TOTALS","Critical","JantoMar17",0.24,0.38,0.15,0.08,0.14000000000000001,1,0.26,0.5,0.13,0.06,0.05,1]
["JantoMar17SCOTLAND TOTALSSubstantial","SCOTLAND TOTALS","Substantial","JantoMar17",0.27,0.28000000000000003,0.13,7.0000000000000007E-2,0.26,1,0.24,0.52,0.12,0.06,0.06,1]
["JantoMar17SCOTLAND TOTALSModerate","SCOTLAND TOTALS","Moderate","JantoMar17",0.22,0.26,0.12,7.0000000000000007E-2,0.33,1,0.23,0.56000000000000005,0.11,0.04,0.06,1]
["JantoMar17SCOTLAND TOTALSLow or No Risk","SCOTLAND TOTALS","Low or No Risk","JantoMar17",0.28000000000000003,0.26,0.14000000000000001,0.03,0.3,1,0.23,0.66,0.04,0.04,0.02,1]
["JantoMar17SCOTLAND TOTALSNot available","SCOTLAND TOTALS","Not available","JantoMar17",0.39,0.21,0.16,7.0000000000000007E-2,0.18,1,0.16,0.63,0.11,0.05,0.06,1]
["JantoMar17SCOTLAND TOTALSTotals","SCOTLAND TOTALS","Totals","JantoMar17",0.28000000000000003,0.28999999999999998,0.14000000000000001,7.0000000000000007E-2,0.22,1,0.22,0.55000000000000004,0.12,0.06,0.06,1]
["JantoMar18Aberdeen CityCritical","Aberdeen City","Critical","JantoMar18",1,0,0,0,0,1,1,0,0,0,0,1]
["JantoMar18Aberdeen CitySubstantial","Aberdeen City","Substantial","JantoMar18",0.48,0.24,0.12,0.12,0.03,1,0.5,0.44,0.06,0,0,1]
["JantoMar18Aberdeen CityModerate","Aberdeen City","Moderate","JantoMar18",1,0,0,0,0,1,0,0,1,0,0,1]
["JantoMar18Aberdeen CityLow or No Risk","Aberdeen City","Low or No Risk","JantoMar18",0,0,0,0,0,0,0,0,0,0,0,0]
["JantoMar18Aberdeen CityNot available","Aberdeen City","Not available","JantoMar18",0.28999999999999998,0.24,0.19,0.24,0.05,1,0.5,0.5,0,0,0,1]
["JantoMar18Aberdeen CityTotals","Aberdeen City","Totals","JantoMar18",0.43,0.23,0.14000000000000001,0.16,0.04,1,0.5,0.41,0.09,0,0,1]
["JantoMar18AberdeenshireCritical","Aberdeenshire","Critical","JantoMar18",0,0,0,0,0,0,0,0,0,0,0,0]
["JantoMar18AberdeenshireSubstantial","Aberdeenshire","Substantial","JantoMar18",0,0,0,0,0,0,0,0,0,0,0,0]
["JantoMar18AberdeenshireModerate","Aberdeenshire","Moderate","JantoMar18",0,0,0,0,0,0,0,0,0,0,0,0]
["JantoMar18AberdeenshireLow or No Risk","Aberdeenshire","Low or No Risk","JantoMar18",0,0,0,0,0,0,0,0,0,0,0,0]
["JantoMar18AberdeenshireNot available","Aberdeenshire","Not available","JantoMar18",0,0,0,0,0,0,0,0,0,0,0,0]
["JantoMar18AberdeenshireTotals","Aberdeenshire","Totals","JantoMar18",0,0,0,0,0,0,0,0,0,0,0,0]
["JantoMar18AngusCritical","Angus","Critical","JantoMar18",0.46,0.15,0.15,0,0.23,1,0.92,0.04,0,0.04,0,1]
["JantoMar18AngusSubstantial","Angus","Substantial","JantoMar18",0.24,0.24,0.1,0.03,0.38,1,0.93,0.04,0.04,0,0,1]
["JantoMar18AngusModerate","Angus","Moderate","JantoMar18",0.37,0.3,0.1,0.03,0.2,1,0.92,0.08,0,0,0,1]
["JantoMar18AngusLow or No Risk","Angus","Low or No Risk","JantoMar18",0.33,0.67,0,0,0,1,0,0.96,0,0.04,0,1]
["JantoMar18AngusNot available","Angus","Not available","JantoMar18",0.67,0,0.33,0,0,1,0,0,0,0,0,0]
["JantoMar18AngusTotals","Angus","Totals","JantoMar18",0.35,0.26,0.12,0.03,0.26,1,0.67,0.3,0.01,0.02,0,1]
["JantoMar18Argyll & ButeCritical","Argyll & Bute","Critical","JantoMar18",0.36,0.36,0.09,0.03,0.16,1,0.43,0.25,0.04,7.0000000000000007E-2,0.21,1]
["JantoMar18Argyll & ButeSubstantial","Argyll & Bute","Substantial","JantoMar18",0.26,0.33,0.1,0.12,0.19,1,0.34,0.14000000000000001,0.06,0.03,0.43,1]
["JantoMar18Argyll & ButeModerate","Argyll & Bute","Moderate","JantoMar18",0.32,0.21,7.0000000000000007E-2,0.11,0.28999999999999998,1,0.5,0.17,0,0,0.33,1]
["JantoMar18Argyll & ButeLow or No Risk","Argyll & Bute","Low or No Risk","JantoMar18",0.5,0.5,0,0,0,1,1,0,0,0,0,1]
["JantoMar18Argyll & ButeNot available","Argyll & Bute","Not available","JantoMar18",0.45,0.18,0.18,0.09,0.09,1,0.98,0,0,0,0.02,1]
["JantoMar18Argyll & ButeTotals","Argyll & Bute","Totals","JantoMar18",0.3,0.32,0.1,0.1,0.19,1,0.56999999999999995,0.12,0.03,0.03,0.25,1]
["JantoMar18ClackmannanshireCritical","Clackmannanshire","Critical","JantoMar18",0.65,0.3,0,0.04,0,1,0,0,0,0,0,0]
["JantoMar18ClackmannanshireSubstantial","Clackmannanshire","Substantial","JantoMar18",0.34,0.27,0.02,7.0000000000000007E-2,0.3,1,0,0,0,0,0,0]
["JantoMar18ClackmannanshireModerate","Clackmannanshire","Moderate","JantoMar18",0.2,0.28000000000000003,0.08,0.04,0.4,1,0,0,0,0,0,0]
["JantoMar18ClackmannanshireLow or No Risk","Clackmannanshire","Low or No Risk","JantoMar18",0.28000000000000003,0.06,0.06,0,0.61,1,0,0,0,0,0,0]
["JantoMar18ClackmannanshireNot available","Clackmannanshire","Not available","JantoMar18",0,0,0,0,0,0,0.1,0.71,0.16,0.01,0.02,1]
["JantoMar18ClackmannanshireTotals","Clackmannanshire","Totals","JantoMar18",0.36,0.25,0.04,0.05,0.31,1,0.1,0.71,0.16,0.01,0.02,1]
["JantoMar18Dumfries and GallowayCritical","Dumfries and Galloway","Critical","JantoMar18",0,0.26,0.19,0.12,0.43,1,0.28000000000000003,0.38,0.11,0.05,0.18,1]
["JantoMar18Dumfries and GallowaySubstantial","Dumfries and Galloway","Substantial","JantoMar18",0.09,0.33,0.3,0.11,0.17,1,0.17,0.48,0.08,0.06,0.22,1]
["JantoMar18Dumfries and GallowayModerate","Dumfries and Galloway","Moderate","JantoMar18",0.11,0.17,0.44,0.11,0.17,1,0.13,0.31,0.38,0,0.19,1]
["JantoMar18Dumfries and GallowayLow or No Risk","Dumfries and Galloway","Low or No Risk","JantoMar18",0,0.63,0.13,0.13,0.13,1,0.67,0,0,0,0.33,1]
["JantoMar18Dumfries and GallowayNot available","Dumfries and Galloway","Not available","JantoMar18",0.47,0.15,0.17,0.11,0.1,1,0.03,0,0,0,0.97,1]
["JantoMar18Dumfries and GallowayTotals","Dumfries and Galloway","Totals","JantoMar18",0.31,0.2,0.2,0.11,0.17,1,0.21,0.34,0.09,0.04,0.31,1]
["JantoMar18Dundee CityCritical","Dundee City","Critical","JantoMar18",0,0,0,0,0,0,0,0,0,0,0,0]
["JantoMar18Dundee CitySubstantial","Dundee City","Substantial","JantoMar18",0,0,0,0,0,0,0,0,0,0,0,0]
["JantoMar18Dundee CityModerate","Dundee City","Moderate","JantoMar18",0,0,0,0,0,0,0,0,0,0,0,0]
["JantoMar18Dundee CityLow or No Risk","Dundee City","Low or No Risk","JantoMar18",0,0,0,0,0,0,0,0,0,0,0,0]
["JantoMar18Dundee CityNot available","Dundee City","Not available","JantoMar18",0,0,0,0,0,0,0,0,0,0,0,0]
["JantoMar18Dundee CityTotals","Dundee City","Totals","JantoMar18",0,0,0,0,0,0,0,0,0,0,0,0]
["JantoMar18East AyrshireCritical","East Ayrshire","Critical","JantoMar18",0,0,0,0,0,0,0,0,0,0,0,0]
["JantoMar18East AyrshireSubstantial","East Ayrshire","Substantial","JantoMar18",0,0,0,0,0,0,0,0,0,0,0,0]
["JantoMar18East AyrshireModerate","East Ayrshire","Moderate","JantoMar18",0,0,0,0,0,0,0,0,0,0,0,0]
["JantoMar18East AyrshireLow or No Risk","East Ayrshire","Low or No Risk","JantoMar18",0,0,0,0,0,0,0,0,0,0,0,0]
[{"$f":"D3217&B3217&C3217","v":"JantoMar18East AyrshireNot available"},"East Ayrshire","Not available","JantoMar18",0,0,0,0,0,0,0,0,0,0,0,0]
["JantoMar18East AyrshireTotals","East Ayrshire","Totals","JantoMar18",0,0,0,0,0,0,0,0,0,0,0,0]
["JantoMar18East DunbartonshireCritical","East Dunbartonshire","Critical","JantoMar18",0.3,0.3,0.2,0.2,0,1,0,1,0,0,0,1]
["JantoMar18East DunbartonshireSubstantial","East Dunbartonshire","Substantial","JantoMar18",0.24,0.24,0.21,0.09,0.23,1,0,0.96,0.01,0.02,0.01,1]
["JantoMar18East DunbartonshireModerate","East Dunbartonshire","Moderate","JantoMar18",0.25,0.33,0.08,0,0.33,1,0,1,0,0,0,1]
["JantoMar18East DunbartonshireLow or No Risk","East Dunbartonshire","Low or No Risk","JantoMar18",0.5,0,0,0,0.5,1,0,1,0,0,0,1]
["JantoMar18East DunbartonshireNot available","East Dunbartonshire","Not available","JantoMar18",0.64,0.36,0,0,0,1,0,0,0,0,0,0]
["JantoMar18East DunbartonshireTotals","East Dunbartonshire","Totals","JantoMar18",0.28000000000000003,0.27,0.16,7.0000000000000007E-2,0.23,1,0,0.97,0.01,0.02,0.01,1]
["JantoMar18East LothianCritical","East Lothian","Critical","JantoMar18",0,0,0,0,0,0,0,0,0,0,0,0]
["JantoMar18East LothianSubstantial","East Lothian","Substantial","JantoMar18",0.22,0.17,0.18,0.21,0.22,1,0.28999999999999998,0.42,0.2,0.1,0,1]
["JantoMar18East LothianModerate","East Lothian","Moderate","JantoMar18",0,0,0,0,0,0,0,0,0,0,0,0]
["JantoMar18East LothianLow or No Risk","East Lothian","Low or No Risk","JantoMar18",0,0,0,0,0,0,0,0,0,0,0,0]
["JantoMar18East LothianNot available","East Lothian","Not available","JantoMar18",0,0,0,0,0,0,0,0,0,0,0,0]
["JantoMar18East LothianTotals","East Lothian","Totals","JantoMar18",0.22,0.17,0.18,0.21,0.22,1,0.28999999999999998,0.42,0.2,0.1,0,1]
["JantoMar18East RenfrewshireCritical","East Renfrewshire","Critical","JantoMar18",0,0,0,0,0,0,0,0,0,0,0,0]
["JantoMar18East RenfrewshireSubstantial","East Renfrewshire","Substantial","JantoMar18",0,0,0,0,0,0,0,0,0,0,0,0]
["JantoMar18East RenfrewshireModerate","East Renfrewshire","Moderate","JantoMar18",0,0,0,0,0,0,0,0,0,0,0,0]
["JantoMar18East RenfrewshireLow or No Risk","East Renfrewshire","Low or No Risk","JantoMar18",0,0,0,0,0,0,0,0,0,0,0,0]
["JantoMar18East RenfrewshireNot available","East Renfrewshire","Not available","JantoMar18",0,0,0,0,0,0,0,0,0,0,0,0]
["JantoMar18East RenfrewshireTotals","East Renfrewshire","Totals","JantoMar18",0,0,0,0,0,0,0,0,0,0,0,0]
["JantoMar18Edinburgh, City ofCritical","Edinburgh, City of","Critical","JantoMar18",0.42,0.38,0.11,0.04,0.05,1,0.01,0.43,0.19,0.1,0.27,1]
["JantoMar18Edinburgh, City ofSubstantial","Edinburgh, City of","Substantial","JantoMar18",0.33,0.39,0.15,0.05,0.08,1,0.02,0.5,0.18,0.08,0.22,1]
["JantoMar18Edinburgh, City ofModerate","Edinburgh, City of","Moderate","JantoMar18",0.18,0.45,0.21,0.09,0.06,1,0,0.67,0,0,0.33,1]
["JantoMar18Edinburgh, City ofLow or No Risk","Edinburgh, City of","Low or No Risk","JantoMar18",0.19,0.44,0.31,0.03,0.03,1,0,0.75,0,0.13,0.13,1]
["JantoMar18Edinburgh, City ofNot available","Edinburgh, City of","Not available","JantoMar18",0.25,0.36,0.19,0.1,0.11,1,0.02,0.52,0.16,0.13,0.17,1]
["JantoMar18Edinburgh, City ofTotals","Edinburgh, City of","Totals","JantoMar18",0.35,0.39,0.15,0.05,7.0000000000000007E-2,1,0.02,0.49,0.17,0.1,0.22,1]
["JantoMar18Eilean SiarCritical","Eilean Siar","Critical","JantoMar18",0.22,0.44,0.22,0,0.11,1,0.2,0.5,0.1,0.1,0.1,1]
["JantoMar18Eilean SiarSubstantial","Eilean Siar","Substantial","JantoMar18",0.15,0.4,0.15,0.2,0.1,1,0.2,0.65,0.05,0,0.1,1]
["JantoMar18Eilean SiarModerate","Eilean Siar","Moderate","JantoMar18",0,0,0,0,0,0,0,0,0,0,0,0]
["JantoMar18Eilean SiarLow or No Risk","Eilean Siar","Low or No Risk","JantoMar18",0,1,0,0,0,1,0,0,0,0,0,0]
["JantoMar18Eilean SiarNot available","Eilean Siar","Not available","JantoMar18",0,0,0,0,0,0,0,0,0,0,0,0]
["JantoMar18Eilean SiarTotals","Eilean Siar","Totals","JantoMar18",0.16,0.45,0.16,0.13,0.1,1,0.2,0.6,7.0000000000000007E-2,0.03,0.1,1]
["JantoMar18FalkirkCritical","Falkirk","Critical","JantoMar18",0.02,0.09,0.12,0.09,0.67,1,1,0,0,0,0,1]
["JantoMar18FalkirkSubstantial","Falkirk","Substantial","JantoMar18",0.08,0.13,0.11,0.09,0.59,1,1,0,0,0,0,1]
["JantoMar18FalkirkModerate","Falkirk","Moderate","JantoMar18",7.0000000000000007E-2,0.25,0.21,0.14000000000000001,0.33,1,1,0,0,0,0,1]
["JantoMar18FalkirkLow or No Risk","Falkirk","Low or No Risk","JantoMar18",0,1,0,0,0,1,1,0,0,0,0,1]
["JantoMar18FalkirkNot available","Falkirk","Not available","JantoMar18",0.01,0.1,0.12,0.1,0.67,1,0,0,0,0,0,0]
["JantoMar18FalkirkTotals","Falkirk","Totals","JantoMar18",0.05,0.15,0.13,0.1,0.56999999999999995,1,1,0,0,0,0,1]
["JantoMar18FifeCritical","Fife","Critical","JantoMar18",0.24,0.48,0.16,0.06,0.06,1,0.04,0.51,0.28999999999999998,0.15,0.01,1]
["JantoMar18FifeSubstantial","Fife","Substantial","JantoMar18",0.12,0.25,0.1,0.17,0.35,1,0.09,0.55000000000000004,0.28000000000000003,7.0000000000000007E-2,0.01,1]
["JantoMar18FifeModerate","Fife","Moderate","JantoMar18",0.05,0.05,0.04,0.15,0.71,1,0.14000000000000001,0.38,0.28999999999999998,0.14000000000000001,0.05,1]
["JantoMar18FifeLow or No Risk","Fife","Low or No Risk","JantoMar18",0.12,0.21,0.15,0.09,0.44,1,0,0.5,0.5,0,0,1]
["JantoMar18FifeNot available","Fife","Not available","JantoMar18",0,0.14000000000000001,0.14000000000000001,0.14000000000000001,0.56999999999999995,1,0,0,0,1,0,1]
["JantoMar18FifeTotals","Fife","Totals","JantoMar18",0.18,0.35,0.13,0.11,0.24,1,0.05,0.51,0.28999999999999998,0.13,0.01,1]
["JantoMar18Glasgow CityCritical","Glasgow City","Critical","JantoMar18",0.24,0.4,0.17,0.1,0.1,1,0,1,0,0,0,1]
["JantoMar18Glasgow CitySubstantial","Glasgow City","Substantial","JantoMar18",0.09,0.38,0.17,7.0000000000000007E-2,0.28999999999999998,1,0,1,0,0,0,1]
["JantoMar18Glasgow CityModerate","Glasgow City","Moderate","JantoMar18",0.08,0.17,0.15,0.02,0.57999999999999996,1,0,1,0,0,0,1]
["JantoMar18Glasgow CityLow or No Risk","Glasgow City","Low or No Risk","JantoMar18",0,0,0,0,0,0,0,0,0,0,0,0]
["JantoMar18Glasgow CityNot available","Glasgow City","Not available","JantoMar18",0.17,0.67,0.12,0,0.03,1,0,1,0,0,0,1]
["JantoMar18Glasgow CityTotals","Glasgow City","Totals","JantoMar18",0.13,0.4,0.17,7.0000000000000007E-2,0.24,1,0,1,0,0,0,1]
["JantoMar18HighlandCritical","Highland","Critical","JantoMar18",0,0.25,0,0,0.75,1,0,0,0,0,0,0]
["JantoMar18HighlandSubstantial","Highland","Substantial","JantoMar18",0.17,0.5,0,0,0.33,1,0,0,0,0,0,0]
["JantoMar18HighlandModerate","Highland","Moderate","JantoMar18",0,0.36,0.18,0.27,0.18,1,0,0,0,0,0,0]
["JantoMar18HighlandLow or No Risk","Highland","Low or No Risk","JantoMar18",0,0,0.67,0,0.33,1,0,0,0,0,0,0]
["JantoMar18HighlandNot available","Highland","Not available","JantoMar18",0,0.5,0,0,0.5,1,0,0,0,0,0,0]
["JantoMar18HighlandTotals","Highland","Totals","JantoMar18",0.04,0.36,0.14000000000000001,0.11,0.36,1,0,0,0,0,0,0]
["JantoMar18InverclydeCritical","Inverclyde","Critical","JantoMar18",0.09,0.36,0.36,0.09,0.09,1,0.09,0.75,0.16,0,0,1]
["JantoMar18InverclydeSubstantial","Inverclyde","Substantial","JantoMar18",0.05,0.49,0.05,0.3,0.11,1,0.14000000000000001,0.84,0.02,0,0,1]
["JantoMar18InverclydeModerate","Inverclyde","Moderate","JantoMar18",0.13,0.33,0,0.2,0.33,1,0.12,0.88,0,0,0,1]
["JantoMar18InverclydeLow or No Risk","Inverclyde","Low or No Risk","JantoMar18",0.5,0.13,0,0.13,0.25,1,0.33,0.67,0,0,0,1]
["JantoMar18InverclydeNot available","Inverclyde","Not available","JantoMar18",0,0,0,0,0,0,0,0,0,0,0,0]
["JantoMar18InverclydeTotals","Inverclyde","Totals","JantoMar18",0.13,0.39,0.08,0.23,0.17,1,0.13,0.82,0.06,0,0,1]
["JantoMar18MidlothianCritical","Midlothian","Critical","JantoMar18",0,0,1,0,0,1,0,0,0,0,1,1]
["JantoMar18MidlothianSubstantial","Midlothian","Substantial","JantoMar18",0,0,0,0,0,0,0,0,0,0,1,1]
[{"$f":"D3281&B3281&C3281","v":"JantoMar18MidlothianModerate"},"Midlothian","Moderate","JantoMar18",0,0.5,0.5,0,0,1,0,0,0,0,0,0]
["JantoMar18MidlothianLow or No Risk","Midlothian","Low or No Risk","JantoMar18",0,0,0,0,0,0,0,0,0,0,0,0]
["JantoMar18MidlothianNot available","Midlothian","Not available","JantoMar18",0.01,7.0000000000000007E-2,0.13,0.14000000000000001,0.65,1,0,0,0,0,1,1]
["JantoMar18MidlothianTotals","Midlothian","Totals","JantoMar18",0.01,0.08,0.16,0.13,0.62,1,0,0,0,0,1,1]
["JantoMar18MorayCritical","Moray","Critical","JantoMar18",0.23,0.46,0,0.08,0.23,1,0.53,0.05,0,0,0.42,1]
["JantoMar18MoraySubstantial","Moray","Substantial","JantoMar18",0.25,0.25,0.25,7.0000000000000007E-2,0.19,1,0.42,0.03,0.03,0.04,0.49,1]
["JantoMar18MorayModerate","Moray","Moderate","JantoMar18",0.26,0.05,0.16,0.37,0.16,1,0.23,0.09,0.14000000000000001,0,0.55000000000000004,1]
["JantoMar18MorayLow or No Risk","Moray","Low or No Risk","JantoMar18",0.25,0,0,0.5,0.25,1,0,0,0,0,1,1]
["JantoMar18MorayNot available","Moray","Not available","JantoMar18",0,0,0,1,0,1,0,0,0,0.17,0.83,1]
["JantoMar18MorayTotals","Moray","Totals","JantoMar18",0.24,0.22,0.18,0.17,0.19,1,0.36,0.04,0.04,0.03,0.53,1]
["JantoMar18North AyrshireCritical","North Ayrshire","Critical","JantoMar18",0,0,0,0,0,0,0,0,0,0,0,0]
["JantoMar18North AyrshireSubstantial","North Ayrshire","Substantial","JantoMar18",0,0,0,0,0,0,0,0,0,0,0,0]
["JantoMar18North AyrshireModerate","North Ayrshire","Moderate","JantoMar18",0,0,0,0,0,0,0,0,0,0,0,0]
["JantoMar18North AyrshireLow or No Risk","North Ayrshire","Low or No Risk","JantoMar18",0,0,0,0,0,0,0,0,0,0,0,0]
["JantoMar18North AyrshireNot available","North Ayrshire","Not available","JantoMar18",0,0,0,0,0,0,0,0,0,0,0,0]
["JantoMar18North AyrshireTotals","North Ayrshire","Totals","JantoMar18",0,0,0,0,0,0,0,0,0,0,0,0]
["JantoMar18North LanarkshireCritical","North Lanarkshire","Critical","JantoMar18",0.27,0.25,0.1,7.0000000000000007E-2,0.31,1,0.23,0.67,0.05,0.02,0.02,1]
["JantoMar18North LanarkshireSubstantial","North Lanarkshire","Substantial","JantoMar18",0.02,0.39,0.13,0.11,0.35,1,0.28999999999999998,0.65,0.04,0,0.01,1]
["JantoMar18North LanarkshireModerate","North Lanarkshire","Moderate","JantoMar18",0.04,0.2,0.14000000000000001,0.08,0.54,1,0.24,0.67,0.04,0,0.06,1]
["JantoMar18North LanarkshireLow or No Risk","North Lanarkshire","Low or No Risk","JantoMar18",0,0.32,0.25,0.04,0.39,1,0.05,0.74,0.05,0,0.16,1]
["JantoMar18North LanarkshireNot available","North Lanarkshire","Not available","JantoMar18",0.63,0.14000000000000001,7.0000000000000007E-2,0.02,0.14000000000000001,1,0.11,0.74,7.0000000000000007E-2,0.01,7.0000000000000007E-2,1]
["JantoMar18North LanarkshireTotals","North Lanarkshire","Totals","JantoMar18",0.23,0.26,0.11,7.0000000000000007E-2,0.33,1,0.22,0.68,0.05,0.01,0.04,1]
["JantoMar18Orkney islandsCritical","Orkney islands","Critical","JantoMar18",0,0,0,0,0,0,0,0,0,0,0,0]
["JantoMar18Orkney islandsSubstantial","Orkney islands","Substantial","JantoMar18",0,0,0,0,0,0,0,0,0,0,0,0]
["JantoMar18Orkney islandsModerate","Orkney islands","Moderate","JantoMar18",0,0,0,0,0,0,0,0,0,0,0,0]
["JantoMar18Orkney islandsLow or No Risk","Orkney islands","Low or No Risk","JantoMar18",0,0,0,0,0,0,0,0,0,0,0,0]
["JantoMar18Orkney islandsNot available","Orkney islands","Not available","JantoMar18",0,0,0,0,0,0,0,0,0,0,0,0]
["JantoMar18Orkney islandsTotals","Orkney islands","Totals","JantoMar18",0,0,0,0,0,0,0,0,0,0,0,0]
["JantoMar18Perth & KinrossCritical","Perth & Kinross","Critical","JantoMar18",0.63,0.33,0.04,0,0,1,0.1,0.74,7.0000000000000007E-2,0.02,0.08,1]
["JantoMar18Perth & KinrossSubstantial","Perth & Kinross","Substantial","JantoMar18",0.31,0.23,0.16,0.09,0.21,1,0.13,0.57999999999999996,0.15,0.05,0.09,1]
["JantoMar18Perth & KinrossModerate","Perth & Kinross","Moderate","JantoMar18",0.17,0.22,0.17,0.14000000000000001,0.3,1,0.03,0.63,0.2,0.04,0.1,1]
["JantoMar18Perth & KinrossLow or No Risk","Perth & Kinross","Low or No Risk","JantoMar18",0.22,0.22,0.11,0.22,0.22,1,0.06,0.75,0.13,0,0.06,1]
["JantoMar18Perth & KinrossNot available","Perth & Kinross","Not available","JantoMar18",0.3,0.55000000000000004,0.05,0.05,0.05,1,0.15,0.56000000000000005,0.16,0.04,0.08,1]
["JantoMar18Perth & KinrossTotals","Perth & Kinross","Totals","JantoMar18",0.28000000000000003,0.28000000000000003,0.14000000000000001,0.1,0.21,1,0.11,0.59,0.16,0.04,0.09,1]
["JantoMar18RenfrewshireCritical","Renfrewshire","Critical","JantoMar18",1,0,0,0,0,1,0,0.75,0.12,0.08,0.05,1]
["JantoMar18RenfrewshireSubstantial","Renfrewshire","Substantial","JantoMar18",1,0,0,0,0,1,0,0.76,0.13,0.06,0.06,1]
["JantoMar18RenfrewshireModerate","Renfrewshire","Moderate","JantoMar18",1,0,0,0,0,1,0,1,0,0,0,1]
["JantoMar18RenfrewshireLow or No Risk","Renfrewshire","Low or No Risk","JantoMar18",1,0,0,0,0,1,0,1,0,0,0,1]
["JantoMar18RenfrewshireNot available","Renfrewshire","Not available","JantoMar18",1,0,0,0,0,1,0,0.89,0.05,0.03,0.02,1]
["JantoMar18RenfrewshireTotals","Renfrewshire","Totals","JantoMar18",1,0,0,0,0,1,0,0.82,0.09,0.05,0.04,1]
["JantoMar18Scottish BordersCritical","Scottish Borders","Critical","JantoMar18",0.15,0.25,0.19,7.0000000000000007E-2,0.34,1,0.02,0.84,0.09,0.04,0.01,1]
["JantoMar18Scottish BordersSubstantial","Scottish Borders","Substantial","JantoMar18",0.08,0.23,0.08,0.15,0.46,1,0,0.71,0.28999999999999998,0,0,1]
["JantoMar18Scottish BordersModerate","Scottish Borders","Moderate","JantoMar18",0,0,0,1,0,1,0,0,0,0,0,0]
["JantoMar18Scottish BordersLow or No Risk","Scottish Borders","Low or No Risk","JantoMar18",0.06,0.15,0.03,0.06,0.7,1,0,0,0,0,0,0]
["JantoMar18Scottish BordersNot available","Scottish Borders","Not available","JantoMar18",0.19,0.38,0.26,0.04,0.13,1,0,0,0,0,0,0]
["JantoMar18Scottish BordersTotals","Scottish Borders","Totals","JantoMar18",0.15,0.27,0.18,7.0000000000000007E-2,0.33,1,0.02,0.83,0.1,0.03,0.01,1]
["JantoMar18Shetland islandsCritical","Shetland islands","Critical","JantoMar18",0.11,0.22,0.11,0.22,0.33,1,0.33,0.33,0.33,0,0,1]
["JantoMar18Shetland islandsSubstantial","Shetland islands","Substantial","JantoMar18",0.1,0.5,0.3,0.1,0,1,0.28999999999999998,0.43,0,0.28999999999999998,0,1]
["JantoMar18Shetland islandsModerate","Shetland islands","Moderate","JantoMar18",0,0,0,0,0,0,0,1,0,0,0,1]
["JantoMar18Shetland islandsLow or No Risk","Shetland islands","Low or No Risk","JantoMar18",0,0,0,0,0,0,0,0,0,0,0,0]
["JantoMar18Shetland islandsNot available","Shetland islands","Not available","JantoMar18",0.1,0.18,0.27,0.11,0.34,1,0,0.92,0.08,0,0,1]
["JantoMar18Shetland islandsTotals","Shetland islands","Totals","JantoMar18",0.1,0.22,0.26,0.12,0.3,1,0.14000000000000001,0.69,0.1,7.0000000000000007E-2,0,1]
["JantoMar18South AyrshireCritical","South Ayrshire","Critical","JantoMar18",0,0,0,0,0,0,0,0,0,0,0,0]
["JantoMar18South AyrshireSubstantial","South Ayrshire","Substantial","JantoMar18",0,0,0,0,0,0,0,0,0,0,0,0]
["JantoMar18South AyrshireModerate","South Ayrshire","Moderate","JantoMar18",0,0,0,0,0,0,0,0,0,0,0,0]
["JantoMar18South AyrshireLow or No Risk","South Ayrshire","Low or No Risk","JantoMar18",0,0,0,0,0,0,0,0,0,0,0,0]
["JantoMar18South AyrshireNot available","South Ayrshire","Not available","JantoMar18",0,0,0,0,0,0,0,0,0,0,0,0]
["JantoMar18South AyrshireTotals","South Ayrshire","Totals","JantoMar18",0,0,0,0,0,0,0,0,0,0,0,0]
["JantoMar18South LanarkshireCritical","South Lanarkshire","Critical","JantoMar18",0,0,0,0,0,0,0,0,0,0,0,0]
["JantoMar18South LanarkshireSubstantial","South Lanarkshire","Substantial","JantoMar18",0,0,0,0,0,0,0,0,0,0,0,0]
["JantoMar18South LanarkshireModerate","South Lanarkshire","Moderate","JantoMar18",0,0,0,0,0,0,0,0,0,0,0,0]
["JantoMar18South LanarkshireLow or No Risk","South Lanarkshire","Low or No Risk","JantoMar18",0,0,0,0,0,0,0,0,0,0,0,0]
["JantoMar18South LanarkshireNot available","South Lanarkshire","Not available","JantoMar18",0,0,0,0,0,0,0,0,0,0,0,0]
["JantoMar18South LanarkshireTotals","South Lanarkshire","Totals","JantoMar18",0,0,0,0,0,0,0,0,0,0,0,0]
[{"$f":"D3345&B3345&C3345","v":"JantoMar18StirlingCritical"},"Stirling","Critical","JantoMar18",0.84,0.02,0.01,0.01,0.12,1,0.12,0.56000000000000005,0.23,0.06,0.04,1]
["JantoMar18StirlingSubstantial","Stirling","Substantial","JantoMar18",0.78,0.04,0,0,0.18,1,0.12,0.36,0.32,0.04,0.16,1]
["JantoMar18StirlingModerate","Stirling","Moderate","JantoMar18",0.5,0,0,0,0.5,1,0,0,0,0,0,0]
["JantoMar18StirlingLow or No Risk","Stirling","Low or No Risk","JantoMar18",0,0,0,0,0,0,0,0,0,0,0,0]
["JantoMar18StirlingNot available","Stirling","Not available","JantoMar18",0.55000000000000004,0.04,0.04,0.08,0.28999999999999998,1,0.28000000000000003,0.31,0.28000000000000003,0.1,0.03,1]
["JantoMar18StirlingTotals","Stirling","Totals","JantoMar18",0.73,0.03,0.02,0.03,0.19,1,0.16,0.44,0.26,7.0000000000000007E-2,7.0000000000000007E-2,1]
["JantoMar18West DunbartonshireCritical","West Dunbartonshire","Critical","JantoMar18",0.13,0.37,7.0000000000000007E-2,0.1,0.33,1,0.92,0.08,0,0,0,1]
["JantoMar18West DunbartonshireSubstantial","West Dunbartonshire","Substantial","JantoMar18",0.33,0.16,0.09,0.05,0.37,1,0.54,0.43,0.03,0,0,1]
["JantoMar18West DunbartonshireModerate","West Dunbartonshire","Moderate","JantoMar18",0.05,0.18,0.13,0.11,0.53,1,0.88,0.09,0.03,0,0,1]
["JantoMar18West DunbartonshireLow or No Risk","West Dunbartonshire","Low or No Risk","JantoMar18",0.08,0.05,0.08,0.11,0.7,1,0.95,0.05,0,0,0,1]
["JantoMar18West DunbartonshireNot available","West Dunbartonshire","Not available","JantoMar18",0,0,0,0,0,0,0,0,0,0,0,0]
["JantoMar18West DunbartonshireTotals","West Dunbartonshire","Totals","JantoMar18",0.11,0.16,0.1,0.1,0.52,1,0.75,0.22,0.02,0,0,1]
["JantoMar18West LothianCritical","West Lothian","Critical","JantoMar18",0.3,0.51,0.1,0.03,0.06,1,0.02,0.2,0.31,0.18,0.28999999999999998,1]
["JantoMar18West LothianSubstantial","West Lothian","Substantial","JantoMar18",0.41,0.46,0.11,0,0.02,1,0.04,0.04,0.3,0.19,0.44,1]
["JantoMar18West LothianModerate","West Lothian","Moderate","JantoMar18",0.18,0.71,0.06,0.06,0,1,0.13,0.13,0.63,0.13,0,1]
["JantoMar18West LothianLow or No Risk","West Lothian","Low or No Risk","JantoMar18",0.17,0.5,0.17,0,0.17,1,0,0.17,0.67,0,0.17,1]
["JantoMar18West LothianNot available","West Lothian","Not available","JantoMar18",0,0,0,0,0,0,0.08,0.11,0.19,0.08,0.53,1]
["JantoMar18West LothianTotals","West Lothian","Totals","JantoMar18",0.31,0.51,0.1,0.02,0.05,1,0.05,0.13,0.31,0.14000000000000001,0.37,1]
["JantoMar18SCOTLAND TOTALSCritical","SCOTLAND TOTALS","Critical","JantoMar18",0.3,0.37,0.13,0.06,0.13,1,0.13,0.59,0.14000000000000001,7.0000000000000007E-2,0.08,1]
["JantoMar18SCOTLAND TOTALSSubstantial","SCOTLAND TOTALS","Substantial","JantoMar18",0.22,0.31,0.14000000000000001,0.09,0.24,1,0.12,0.68,0.09,0.03,7.0000000000000007E-2,1]
["JantoMar18SCOTLAND TOTALSModerate","SCOTLAND TOTALS","Moderate","JantoMar18",0.14000000000000001,0.2,0.12,0.1,0.44,1,0.22,0.55000000000000004,0.14000000000000001,0.03,7.0000000000000007E-2,1]
["JantoMar18SCOTLAND TOTALSLow or No Risk","SCOTLAND TOTALS","Low or No Risk","JantoMar18",0.16,0.21,0.13,7.0000000000000007E-2,0.44,1,0.25,0.57999999999999996,0.08,0.02,7.0000000000000007E-2,1]
["JantoMar18SCOTLAND TOTALSNot available","SCOTLAND TOTALS","Not available","JantoMar18",0.41,0.22,0.13,7.0000000000000007E-2,0.17,1,0.11,0.56999999999999995,0.11,0.05,0.15,1]
["JantoMar18SCOTLAND TOTALSTotals","SCOTLAND TOTALS","Totals","JantoMar18",0.26,0.3,0.13,0.08,0.22,1,0.13,0.62,0.11,0.05,0.09,1]