{"text_format":"1","workbook":"xlsx","n_sheets":6,"sheets":["Intro","TablesA&B - Client numbers","TableC - Time interval (LA)","TableD - Time interval (EC)","LKPS","Data"],"not_rendered":{"charts":0,"images":0,"macros":1,"external_links":0,"defined_names":4,"comments":0,"pivot_tables":0},"unopened":[],"bounds":{"document_bytes":16777216,"sheet_cells":100000,"rows_first":2000,"rows_last":500,"rows_between":2000,"halvings":0,"cell_chars":16384,"cell_head_chars":4096},"cells_cut":0,"cells_raw":0,"read":"whole","date_system":"1900"}

{"sheet":"Intro","index":0,"n_rows":51,"n_cols":9,"rows_kept":51,"cut":false,"hidden":false,"merged":[[45,8,45,12],[50,3,50,4],[47,1,47,9],[49,1,49,9],[33,3,33,12],[43,3,43,12],[31,1,31,12],[7,1,7,2],[11,2,11,13],[25,3,25,12],[23,1,23,12],[21,1,21,12],[7,3,7,12],[6,3,6,12],[27,3,27,12],[29,3,29,12],[4,1,4,2],[5,1,5,2],[6,1,6,2],[4,3,4,12],[5,3,5,12],[17,2,17,12]]}
[" ","ELIGIBILITY CRITERIA and WAITING TIMES - Data Tables"]
[]
[null,"Data available"]
[]
[null,"Table A",null,"Presents the number of new clients and the rate per 1,000 population for clients recorded as being new to social work services (as defined below) who received a community care assessment in the quarter."]
[null,"Table B",null,"Presents the number of new Personal Care (PC) clients and the rate per 1,000 population for clients recorded as receiving a new service (as defined below) within the quarter."]
[null,"Table C",null,"Presents data on the time intervals recorded for clients by Eligibility Category between first contact and completion of assessment and between completion of assessment and service delivery. "]
[null,"Table D",null,"Presents individual Local Authority data on the time intervals recorded for clients between first contact and completion of assessment and between completion of assessment and service delivery by Eligibility Category."]
[]
[null,"Notes"]
[]
[null,"1 - ","Not all Local Authorities have been able to return data for this collection. Authorities without data have had their figures denoted as \"NR\" (Not Returned) in the data tables."]
[null,"2 - ","Data is collected on the reason for delays of over six weeks for the delivery of service, the main reasons provided include:"]
[null,null,"-","Waiting for a vacancy in a care home of family choice, or for appropriate care at home services"]
[null,null,"-","Admission / re-admission into hospital"]
{"$rows_left_out":37}
{"sheet":"TablesA&B - Client numbers","index":1,"n_rows":83,"n_cols":17,"rows_kept":83,"cut":false,"hidden":false,"merged":[[2,3,2,16],[44,3,44,16],[3,5,3,6],[45,5,45,6],[3,7,3,8],[45,7,45,8],[3,13,3,14],[45,13,45,14],[3,3,3,4],[45,3,45,4],[3,15,3,16],[45,15,45,16],[3,11,3,12],[45,11,45,12],[3,9,3,10],[45,9,45,10]]}
[null,"Table A - NEW Clients receiving a community care assessment in the quarter, January to March 2012 - 2018"]
[]
["2011"]
[null,null,null,"January to March 2012",null,"January to March 2013",null,"January to March 2014",null,"January to March 2015",null,"January to March 2016",null,"January to March 2017",null,"January to March 2018"]
["Totals"," ","Local Authority","Number of new clients","Rate per 1,000 population","Number of new clients","Rate per 1,000 population","Number of new clients","Rate per 1,000 population","Number of new clients","Rate per 1,000 population","Number of new clients","Rate per 1,000 population","Number of new clients","Rate per 1,000 population","Number of new clients","Rate per 1,000 population"]
["JantoMar11"," ","Aberdeen City",136,3.9847641371227662,151,4.478984368047934,49,1.4535746069415605,68,1.9847060883777947,42,1.2200081333875559,56,1.6612281222189262,56,1.5867618723790093]
["AprtoJun11"," ","Aberdeenshire",250,5.5909650005590965,271,6.1063542136097348,199,4.4836987134713739,210,4.5861541821358376,378,8.0923123033118536,322,7.2550300790843334,"NR",""]
["JultoSep11"," ","Angus",183,7.3094743569260263,106,4.2467948717948714,224,8.9686098654708513,77,3.0025346071358938,97,3.7197530390765809,122,4.8846893017296606,59,2.2010818877075176]
["Clients numbers Q1 & Q2"," ","Argyll & Bute",99,4.7703946417385437,265,12.851600387972843,199,9.645678832824391,173,8.1928395529456335,113,5.2991933971112362,125,6.058843487955019,240,10.990520675917022]
[8,null,"Clackmannanshire",89,9.7235878946793406,88,9.7571792881694197,83,9.2007537966965973,87,9.326758147512864,86,8.8907267652227837,111,12.304622547389425,110,10.945273631840797]
["OcttoDec11"," ","Dumfries and Galloway",171,4.8300991441403269,179,5.1099057950328293,186,5.3073103920561548,330,9.2217409529132315,311,8.5578272474615442,227,6.4772013924556298,402,10.746077147210565]
[null,null,"Dundee City",314,12.16064443669881,402,15.800023582124751,342,13.442339438723371,350,13.570099255583127,320,12.375280377446051,406,15.957864947724234,"NR",""]
[null,null,"East Ayrshire",113,4.889446583877807,230,10.089046804404088,293,12.850877192982457,269,11.591330202094197,283,12.036918889030666,375,16.44736842105263,"NR",""]
[0,null,"East Dunbartonshire",237,10.739532354540511,235,10.679876386111616,212,9.641622703292704,248,10.969083108496617,222,9.6471406222840255,215,9.7780607604147711,160,6.7519095244123735]
[null,null,"East Lothian",202,10.530705870086539,206,10.785340314136127,159,8.321993091175548,131,6.7165709598031169,146,7.3238023576624034,164,8.5836909871244629,144,6.9044879171461444]
{"$rows_left_out":69}
{"sheet":"TableC - Time interval (LA)","index":2,"n_rows":46,"n_cols":17,"rows_kept":46,"cut":false,"hidden":false,"merged":[[0,1,0,14],[8,3,8,8],[8,10,8,15]]}
[null,{"$f":"\"Table C - Time intervals recorded for clients \" &A12& \" between first contact and completion of assessment and between completion of assessment and service delivery. Quarter - \"&A9","v":"Table C - Time intervals recorded for clients in ALL Eligibility Categories between first contact and completion of assessment and between completion of assessment and service delivery. Quarter - January to March 2018"}]
[]
["Year"]
[2011,null,"Select Quarter",null,null,"Select Eligibility Category"]
[null,null,null,null,null,null,null,null,null,null,null,null,{"$f":"OFFSET(LKPS!B2,A6,0)","v":"January to March 2018"}]
[7]
[{"$f":"OFFSET(LKPS!D2,A6,0)","v":"JantoMar18"}," "]
[{"$f":"OFFSET(LKPS!B3,A6,0)","v":0}," ",null,5,6,7,8,9,10,null,11,12,13,14,15,16]
[{"$f":"OFFSET(LKPS!B2,A6,0)","v":"January to March 2018"},null,null,"Time interval between first contact and completion of assessment",null,null,null,null,null,null,"Time interval between completion of assessment and service delivery"]
[6,null,"Local Authority","Less than or equal to 2 days","More than 2 days and <= 2 weeks","More than 2 weeks and <= 4 weeks","More than 4 weeks and <= 6 weeks","More than 6 weeks","Total",null,"Before care assessment completed","Less than or equal to 2 weeks","More than 2 weeks and <= 4 weeks","More than 4 weeks and <= 6 weeks","More than 6 weeks ","Total"]
[{"$f":"OFFSET(LKPS!F2,A10,0)","v":"Totals"}," ","Aberdeen City",{"$f":"IF($J11=\"NR\",\"NR\",(VLOOKUP($A$7&$C11&$A$11,Data!$A:$P,D$8,FALSE)))","v":0.43},{"$f":"IF($J11=\"NR\",\"NR\",(VLOOKUP($A$7&$C11&$A$11,Data!$A:$P,E$8,FALSE)))","v":0.23},{"$f":"IF($J11=\"NR\",\"NR\",(VLOOKUP($A$7&$C11&$A$11,Data!$A:$P,F$8,FALSE)))","v":0.14000000000000001},{"$f":"IF($J11=\"NR\",\"NR\",(VLOOKUP($A$7&$C11&$A$11,Data!$A:$P,G$8,FALSE)))","v":0.16},{"$f":"IF($J11=\"NR\",\"NR\",(VLOOKUP($A$7&$C11&$A$11,Data!$A:$P,H$8,FALSE)))","v":0.04},{"$f":"IF($J11=\"NR\",\"NR\",(VLOOKUP($A$7&$C11&$A$11,Data!$A:$P,I$8,FALSE)))","v":1},{"$f":"IF(VLOOKUP($A$7&$C11&\"Totals\",Data!$A:$P,I$8,FALSE)=0,\"NR\",(VLOOKUP($A$7&$C11&\"Totals\",Data!$A:$P,I$8,FALSE)))","v":1},{"$f":"IF($Q11=\"NR\",\"NR\",(VLOOKUP($A$7&$C11&$A$11,Data!$A:$P,K$8,FALSE)))","v":0.5},{"$f":"IF($Q11=\"NR\",\"NR\",(VLOOKUP($A$7&$C11&$A$11,Data!$A:$P,L$8,FALSE)))","v":0.41},{"$f":"IF($Q11=\"NR\",\"NR\",(VLOOKUP($A$7&$C11&$A$11,Data!$A:$P,M$8,FALSE)))","v":0.09},{"$f":"IF($Q11=\"NR\",\"NR\",(VLOOKUP($A$7&$C11&$A$11,Data!$A:$P,N$8,FALSE)))","v":0},{"$f":"IF($Q11=\"NR\",\"NR\",(VLOOKUP($A$7&$C11&$A$11,Data!$A:$P,O$8,FALSE)))","v":0},{"$f":"IF($Q11=\"NR\",\"NR\",(VLOOKUP($A$7&$C11&$A$11,Data!$A:$P,P$8,FALSE)))","v":1},{"$f":"IF(VLOOKUP($A$7&$C11&\"Totals\",Data!$A:$P,P$8,FALSE)=0,\"NR\",(VLOOKUP($A$7&$C11&\"Totals\",Data!$A:$P,P$8,FALSE)))","v":1}]
[{"$f":"IF(A10=6,\"in ALL Eligibility Categories\",(\"in the \"&A11&\" Eligibility Category\"))","v":"in ALL Eligibility Categories"}," ","Aberdeenshire",{"$f":"IF($J12=\"NR\",\"NR\",(VLOOKUP($A$7&$C12&$A$11,Data!$A:$P,D$8,FALSE)))","v":"NR"},{"$f":"IF($J12=\"NR\",\"NR\",(VLOOKUP($A$7&$C12&$A$11,Data!$A:$P,E$8,FALSE)))","v":"NR"},{"$f":"IF($J12=\"NR\",\"NR\",(VLOOKUP($A$7&$C12&$A$11,Data!$A:$P,F$8,FALSE)))","v":"NR"},{"$f":"IF($J12=\"NR\",\"NR\",(VLOOKUP($A$7&$C12&$A$11,Data!$A:$P,G$8,FALSE)))","v":"NR"},{"$f":"IF($J12=\"NR\",\"NR\",(VLOOKUP($A$7&$C12&$A$11,Data!$A:$P,H$8,FALSE)))","v":"NR"},{"$f":"IF($J12=\"NR\",\"NR\",(VLOOKUP($A$7&$C12&$A$11,Data!$A:$P,I$8,FALSE)))","v":"NR"},{"$f":"IF(VLOOKUP($A$7&$C12&\"Totals\",Data!$A:$P,I$8,FALSE)=0,\"NR\",(VLOOKUP($A$7&$C12&\"Totals\",Data!$A:$P,I$8,FALSE)))","v":"NR"},{"$f":"IF($Q12=\"NR\",\"NR\",(VLOOKUP($A$7&$C12&$A$11,Data!$A:$P,K$8,FALSE)))","v":"NR"},{"$f":"IF($Q12=\"NR\",\"NR\",(VLOOKUP($A$7&$C12&$A$11,Data!$A:$P,L$8,FALSE)))","v":"NR"},{"$f":"IF($Q12=\"NR\",\"NR\",(VLOOKUP($A$7&$C12&$A$11,Data!$A:$P,M$8,FALSE)))","v":"NR"},{"$f":"IF($Q12=\"NR\",\"NR\",(VLOOKUP($A$7&$C12&$A$11,Data!$A:$P,N$8,FALSE)))","v":"NR"},{"$f":"IF($Q12=\"NR\",\"NR\",(VLOOKUP($A$7&$C12&$A$11,Data!$A:$P,O$8,FALSE)))","v":"NR"},{"$f":"IF($Q12=\"NR\",\"NR\",(VLOOKUP($A$7&$C12&$A$11,Data!$A:$P,P$8,FALSE)))","v":"NR"},{"$f":"IF(VLOOKUP($A$7&$C12&\"Totals\",Data!$A:$P,P$8,FALSE)=0,\"NR\",(VLOOKUP($A$7&$C12&\"Totals\",Data!$A:$P,P$8,FALSE)))","v":"NR"}]
[null,null,"Angus",{"$f":"IF($J13=\"NR\",\"NR\",(VLOOKUP($A$7&$C13&$A$11,Data!$A:$P,D$8,FALSE)))","v":0.35},{"$f":"IF($J13=\"NR\",\"NR\",(VLOOKUP($A$7&$C13&$A$11,Data!$A:$P,E$8,FALSE)))","v":0.26},{"$f":"IF($J13=\"NR\",\"NR\",(VLOOKUP($A$7&$C13&$A$11,Data!$A:$P,F$8,FALSE)))","v":0.12},{"$f":"IF($J13=\"NR\",\"NR\",(VLOOKUP($A$7&$C13&$A$11,Data!$A:$P,G$8,FALSE)))","v":0.03},{"$f":"IF($J13=\"NR\",\"NR\",(VLOOKUP($A$7&$C13&$A$11,Data!$A:$P,H$8,FALSE)))","v":0.26},{"$f":"IF($J13=\"NR\",\"NR\",(VLOOKUP($A$7&$C13&$A$11,Data!$A:$P,I$8,FALSE)))","v":1},{"$f":"IF(VLOOKUP($A$7&$C13&\"Totals\",Data!$A:$P,I$8,FALSE)=0,\"NR\",(VLOOKUP($A$7&$C13&\"Totals\",Data!$A:$P,I$8,FALSE)))","v":1},{"$f":"IF($Q13=\"NR\",\"NR\",(VLOOKUP($A$7&$C13&$A$11,Data!$A:$P,K$8,FALSE)))","v":0.67},{"$f":"IF($Q13=\"NR\",\"NR\",(VLOOKUP($A$7&$C13&$A$11,Data!$A:$P,L$8,FALSE)))","v":0.3},{"$f":"IF($Q13=\"NR\",\"NR\",(VLOOKUP($A$7&$C13&$A$11,Data!$A:$P,M$8,FALSE)))","v":0.01},{"$f":"IF($Q13=\"NR\",\"NR\",(VLOOKUP($A$7&$C13&$A$11,Data!$A:$P,N$8,FALSE)))","v":0.02},{"$f":"IF($Q13=\"NR\",\"NR\",(VLOOKUP($A$7&$C13&$A$11,Data!$A:$P,O$8,FALSE)))","v":0},{"$f":"IF($Q13=\"NR\",\"NR\",(VLOOKUP($A$7&$C13&$A$11,Data!$A:$P,P$8,FALSE)))","v":1},{"$f":"IF(VLOOKUP($A$7&$C13&\"Totals\",Data!$A:$P,P$8,FALSE)=0,\"NR\",(VLOOKUP($A$7&$C13&\"Totals\",Data!$A:$P,P$8,FALSE)))","v":1}]
[null,null,"Argyll & Bute",{"$f":"IF($J14=\"NR\",\"NR\",(VLOOKUP($A$7&$C14&$A$11,Data!$A:$P,D$8,FALSE)))","v":0.3},{"$f":"IF($J14=\"NR\",\"NR\",(VLOOKUP($A$7&$C14&$A$11,Data!$A:$P,E$8,FALSE)))","v":0.32},{"$f":"IF($J14=\"NR\",\"NR\",(VLOOKUP($A$7&$C14&$A$11,Data!$A:$P,F$8,FALSE)))","v":0.1},{"$f":"IF($J14=\"NR\",\"NR\",(VLOOKUP($A$7&$C14&$A$11,Data!$A:$P,G$8,FALSE)))","v":0.1},{"$f":"IF($J14=\"NR\",\"NR\",(VLOOKUP($A$7&$C14&$A$11,Data!$A:$P,H$8,FALSE)))","v":0.19},{"$f":"IF($J14=\"NR\",\"NR\",(VLOOKUP($A$7&$C14&$A$11,Data!$A:$P,I$8,FALSE)))","v":1},{"$f":"IF(VLOOKUP($A$7&$C14&\"Totals\",Data!$A:$P,I$8,FALSE)=0,\"NR\",(VLOOKUP($A$7&$C14&\"Totals\",Data!$A:$P,I$8,FALSE)))","v":1},{"$f":"IF($Q14=\"NR\",\"NR\",(VLOOKUP($A$7&$C14&$A$11,Data!$A:$P,K$8,FALSE)))","v":0.56999999999999995},{"$f":"IF($Q14=\"NR\",\"NR\",(VLOOKUP($A$7&$C14&$A$11,Data!$A:$P,L$8,FALSE)))","v":0.12},{"$f":"IF($Q14=\"NR\",\"NR\",(VLOOKUP($A$7&$C14&$A$11,Data!$A:$P,M$8,FALSE)))","v":0.03},{"$f":"IF($Q14=\"NR\",\"NR\",(VLOOKUP($A$7&$C14&$A$11,Data!$A:$P,N$8,FALSE)))","v":0.03},{"$f":"IF($Q14=\"NR\",\"NR\",(VLOOKUP($A$7&$C14&$A$11,Data!$A:$P,O$8,FALSE)))","v":0.25},{"$f":"IF($Q14=\"NR\",\"NR\",(VLOOKUP($A$7&$C14&$A$11,Data!$A:$P,P$8,FALSE)))","v":1},{"$f":"IF(VLOOKUP($A$7&$C14&\"Totals\",Data!$A:$P,P$8,FALSE)=0,\"NR\",(VLOOKUP($A$7&$C14&\"Totals\",Data!$A:$P,P$8,FALSE)))","v":1}]
[null,null,"Clackmannanshire",{"$f":"IF($J15=\"NR\",\"NR\",(VLOOKUP($A$7&$C15&$A$11,Data!$A:$P,D$8,FALSE)))","v":0.36},{"$f":"IF($J15=\"NR\",\"NR\",(VLOOKUP($A$7&$C15&$A$11,Data!$A:$P,E$8,FALSE)))","v":0.25},{"$f":"IF($J15=\"NR\",\"NR\",(VLOOKUP($A$7&$C15&$A$11,Data!$A:$P,F$8,FALSE)))","v":0.04},{"$f":"IF($J15=\"NR\",\"NR\",(VLOOKUP($A$7&$C15&$A$11,Data!$A:$P,G$8,FALSE)))","v":0.05},{"$f":"IF($J15=\"NR\",\"NR\",(VLOOKUP($A$7&$C15&$A$11,Data!$A:$P,H$8,FALSE)))","v":0.31},{"$f":"IF($J15=\"NR\",\"NR\",(VLOOKUP($A$7&$C15&$A$11,Data!$A:$P,I$8,FALSE)))","v":1},{"$f":"IF(VLOOKUP($A$7&$C15&\"Totals\",Data!$A:$P,I$8,FALSE)=0,\"NR\",(VLOOKUP($A$7&$C15&\"Totals\",Data!$A:$P,I$8,FALSE)))","v":1},{"$f":"IF($Q15=\"NR\",\"NR\",(VLOOKUP($A$7&$C15&$A$11,Data!$A:$P,K$8,FALSE)))","v":0.1},{"$f":"IF($Q15=\"NR\",\"NR\",(VLOOKUP($A$7&$C15&$A$11,Data!$A:$P,L$8,FALSE)))","v":0.71},{"$f":"IF($Q15=\"NR\",\"NR\",(VLOOKUP($A$7&$C15&$A$11,Data!$A:$P,M$8,FALSE)))","v":0.16},{"$f":"IF($Q15=\"NR\",\"NR\",(VLOOKUP($A$7&$C15&$A$11,Data!$A:$P,N$8,FALSE)))","v":0.01},{"$f":"IF($Q15=\"NR\",\"NR\",(VLOOKUP($A$7&$C15&$A$11,Data!$A:$P,O$8,FALSE)))","v":0.02},{"$f":"IF($Q15=\"NR\",\"NR\",(VLOOKUP($A$7&$C15&$A$11,Data!$A:$P,P$8,FALSE)))","v":1},{"$f":"IF(VLOOKUP($A$7&$C15&\"Totals\",Data!$A:$P,P$8,FALSE)=0,\"NR\",(VLOOKUP($A$7&$C15&\"Totals\",Data!$A:$P,P$8,FALSE)))","v":1}]
{"$rows_left_out":32}
{"sheet":"TableD - Time interval (EC)","index":3,"n_rows":16,"n_cols":16,"rows_kept":16,"cut":false,"hidden":false,"merged":[[5,10,5,15],[5,3,5,8],[0,1,0,14]]}
[null,{"$f":"\"Table D - Time intervals recorded for clients in \" &A2& \" between first contact and completion of assessment and between completion of assessment and service delivery. Quarter - \"&A9","v":"Table D - Time intervals recorded for clients in Scotland between first contact and completion of assessment and between completion of assessment and service delivery. Quarter - January to March 2018"}]
[{"$f":"OFFSET(LKPS!H2,A3,0)","v":"Scotland"}]
[33,null,"Select Quarter",null,null,"Select area"]
[{"$f":"IF(A3=33,\"SCOTLAND TOTALS\",(OFFSET(LKPS!H2,A3,0)))","v":"SCOTLAND TOTALS"}," "]
[null,null,null,5,6,7,8,9,10,null,11,12,13,14,15,16]
[7,null,null,"Time interval between first contact and completion of assessment",null,null,null,null,null,null,"Time interval between completion of assessment and service delivery"]
[{"$f":"OFFSET(LKPS!D2,A6,0)","v":"JantoMar18"}," ","Eligibility Category","Less than or equal to 2 days","More than 2 days and <= 2 weeks","More than 2 weeks and <= 4 weeks","More than 4 weeks and <= 6 weeks","More than 6 weeks","Total",null,"Before care assessment completed","Less than or equal to 2 weeks","More than 2 weeks and <= 4 weeks","More than 4 weeks and <= 6 weeks","More than 6 weeks ","Total"]
[null," ","Critical",{"$f":"VLOOKUP($A$7&$A$4&$C8,Data!$A:$P,D$5,FALSE)","v":0.3},{"$f":"VLOOKUP($A$7&$A$4&$C8,Data!$A:$P,E$5,FALSE)","v":0.37},{"$f":"VLOOKUP($A$7&$A$4&$C8,Data!$A:$P,F$5,FALSE)","v":0.13},{"$f":"VLOOKUP($A$7&$A$4&$C8,Data!$A:$P,G$5,FALSE)","v":0.06},{"$f":"VLOOKUP($A$7&$A$4&$C8,Data!$A:$P,H$5,FALSE)","v":0.13},{"$f":"VLOOKUP($A$7&$A$4&$C8,Data!$A:$P,I$5,FALSE)","v":1},null,{"$f":"IF($P$13=\"NR\",\"NR\",(VLOOKUP($A$7&$A$4&$C8,Data!$A:$P,K$5,FALSE)))","v":0.13},{"$f":"IF($P$13=\"NR\",\"NR\",(VLOOKUP($A$7&$A$4&$C8,Data!$A:$P,L$5,FALSE)))","v":0.59},{"$f":"IF($P$13=\"NR\",\"NR\",(VLOOKUP($A$7&$A$4&$C8,Data!$A:$P,M$5,FALSE)))","v":0.14000000000000001},{"$f":"IF($P$13=\"NR\",\"NR\",(VLOOKUP($A$7&$A$4&$C8,Data!$A:$P,N$5,FALSE)))","v":7.0000000000000007E-2},{"$f":"IF($P$13=\"NR\",\"NR\",(VLOOKUP($A$7&$A$4&$C8,Data!$A:$P,O$5,FALSE)))","v":0.08},{"$f":"IF($P$13=\"NR\",\"NR\",(VLOOKUP($A$7&$A$4&$C8,Data!$A:$P,P$5,FALSE)))","v":1}]
[{"$f":"OFFSET(LKPS!B2,A6,0)","v":"January to March 2018"},null,"Substantial",{"$f":"VLOOKUP($A$7&$A$4&$C9,Data!$A:$P,D$5,FALSE)","v":0.22},{"$f":"VLOOKUP($A$7&$A$4&$C9,Data!$A:$P,E$5,FALSE)","v":0.31},{"$f":"VLOOKUP($A$7&$A$4&$C9,Data!$A:$P,F$5,FALSE)","v":0.14000000000000001},{"$f":"VLOOKUP($A$7&$A$4&$C9,Data!$A:$P,G$5,FALSE)","v":0.09},{"$f":"VLOOKUP($A$7&$A$4&$C9,Data!$A:$P,H$5,FALSE)","v":0.24},{"$f":"VLOOKUP($A$7&$A$4&$C9,Data!$A:$P,I$5,FALSE)","v":1},null,{"$f":"IF($P$13=\"NR\",\"NR\",(VLOOKUP($A$7&$A$4&$C9,Data!$A:$P,K$5,FALSE)))","v":0.12},{"$f":"IF($P$13=\"NR\",\"NR\",(VLOOKUP($A$7&$A$4&$C9,Data!$A:$P,L$5,FALSE)))","v":0.68},{"$f":"IF($P$13=\"NR\",\"NR\",(VLOOKUP($A$7&$A$4&$C9,Data!$A:$P,M$5,FALSE)))","v":0.09},{"$f":"IF($P$13=\"NR\",\"NR\",(VLOOKUP($A$7&$A$4&$C9,Data!$A:$P,N$5,FALSE)))","v":0.03},{"$f":"IF($P$13=\"NR\",\"NR\",(VLOOKUP($A$7&$A$4&$C9,Data!$A:$P,O$5,FALSE)))","v":7.0000000000000007E-2},{"$f":"IF($P$13=\"NR\",\"NR\",(VLOOKUP($A$7&$A$4&$C9,Data!$A:$P,P$5,FALSE)))","v":1}]
[null,null,"Moderate",{"$f":"VLOOKUP($A$7&$A$4&$C10,Data!$A:$P,D$5,FALSE)","v":0.14000000000000001},{"$f":"VLOOKUP($A$7&$A$4&$C10,Data!$A:$P,E$5,FALSE)","v":0.2},{"$f":"VLOOKUP($A$7&$A$4&$C10,Data!$A:$P,F$5,FALSE)","v":0.12},{"$f":"VLOOKUP($A$7&$A$4&$C10,Data!$A:$P,G$5,FALSE)","v":0.1},{"$f":"VLOOKUP($A$7&$A$4&$C10,Data!$A:$P,H$5,FALSE)","v":0.44},{"$f":"VLOOKUP($A$7&$A$4&$C10,Data!$A:$P,I$5,FALSE)","v":1},null,{"$f":"IF($P$13=\"NR\",\"NR\",(VLOOKUP($A$7&$A$4&$C10,Data!$A:$P,K$5,FALSE)))","v":0.22},{"$f":"IF($P$13=\"NR\",\"NR\",(VLOOKUP($A$7&$A$4&$C10,Data!$A:$P,L$5,FALSE)))","v":0.55000000000000004},{"$f":"IF($P$13=\"NR\",\"NR\",(VLOOKUP($A$7&$A$4&$C10,Data!$A:$P,M$5,FALSE)))","v":0.14000000000000001},{"$f":"IF($P$13=\"NR\",\"NR\",(VLOOKUP($A$7&$A$4&$C10,Data!$A:$P,N$5,FALSE)))","v":0.03},{"$f":"IF($P$13=\"NR\",\"NR\",(VLOOKUP($A$7&$A$4&$C10,Data!$A:$P,O$5,FALSE)))","v":7.0000000000000007E-2},{"$f":"IF($P$13=\"NR\",\"NR\",(VLOOKUP($A$7&$A$4&$C10,Data!$A:$P,P$5,FALSE)))","v":1}]
[2011,null,"Low or No Risk",{"$f":"VLOOKUP($A$7&$A$4&$C11,Data!$A:$P,D$5,FALSE)","v":0.16},{"$f":"VLOOKUP($A$7&$A$4&$C11,Data!$A:$P,E$5,FALSE)","v":0.21},{"$f":"VLOOKUP($A$7&$A$4&$C11,Data!$A:$P,F$5,FALSE)","v":0.13},{"$f":"VLOOKUP($A$7&$A$4&$C11,Data!$A:$P,G$5,FALSE)","v":7.0000000000000007E-2},{"$f":"VLOOKUP($A$7&$A$4&$C11,Data!$A:$P,H$5,FALSE)","v":0.44},{"$f":"VLOOKUP($A$7&$A$4&$C11,Data!$A:$P,I$5,FALSE)","v":1},null,{"$f":"IF($P$13=\"NR\",\"NR\",(VLOOKUP($A$7&$A$4&$C11,Data!$A:$P,K$5,FALSE)))","v":0.25},{"$f":"IF($P$13=\"NR\",\"NR\",(VLOOKUP($A$7&$A$4&$C11,Data!$A:$P,L$5,FALSE)))","v":0.57999999999999996},{"$f":"IF($P$13=\"NR\",\"NR\",(VLOOKUP($A$7&$A$4&$C11,Data!$A:$P,M$5,FALSE)))","v":0.08},{"$f":"IF($P$13=\"NR\",\"NR\",(VLOOKUP($A$7&$A$4&$C11,Data!$A:$P,N$5,FALSE)))","v":0.02},{"$f":"IF($P$13=\"NR\",\"NR\",(VLOOKUP($A$7&$A$4&$C11,Data!$A:$P,O$5,FALSE)))","v":7.0000000000000007E-2},{"$f":"IF($P$13=\"NR\",\"NR\",(VLOOKUP($A$7&$A$4&$C11,Data!$A:$P,P$5,FALSE)))","v":1}]
[null,null,"Not available",{"$f":"VLOOKUP($A$7&$A$4&$C12,Data!$A:$P,D$5,FALSE)","v":0.41},{"$f":"VLOOKUP($A$7&$A$4&$C12,Data!$A:$P,E$5,FALSE)","v":0.22},{"$f":"VLOOKUP($A$7&$A$4&$C12,Data!$A:$P,F$5,FALSE)","v":0.13},{"$f":"VLOOKUP($A$7&$A$4&$C12,Data!$A:$P,G$5,FALSE)","v":7.0000000000000007E-2},{"$f":"VLOOKUP($A$7&$A$4&$C12,Data!$A:$P,H$5,FALSE)","v":0.17},{"$f":"VLOOKUP($A$7&$A$4&$C12,Data!$A:$P,I$5,FALSE)","v":1},null,{"$f":"IF($P$13=\"NR\",\"NR\",(VLOOKUP($A$7&$A$4&$C12,Data!$A:$P,K$5,FALSE)))","v":0.11},{"$f":"IF($P$13=\"NR\",\"NR\",(VLOOKUP($A$7&$A$4&$C12,Data!$A:$P,L$5,FALSE)))","v":0.56999999999999995},{"$f":"IF($P$13=\"NR\",\"NR\",(VLOOKUP($A$7&$A$4&$C12,Data!$A:$P,M$5,FALSE)))","v":0.11},{"$f":"IF($P$13=\"NR\",\"NR\",(VLOOKUP($A$7&$A$4&$C12,Data!$A:$P,N$5,FALSE)))","v":0.05},{"$f":"IF($P$13=\"NR\",\"NR\",(VLOOKUP($A$7&$A$4&$C12,Data!$A:$P,O$5,FALSE)))","v":0.15},{"$f":"IF($P$13=\"NR\",\"NR\",(VLOOKUP($A$7&$A$4&$C12,Data!$A:$P,P$5,FALSE)))","v":1}]
[null,null,"Total",{"$f":"VLOOKUP($A$7&$A$4&\"Totals\",Data!$A:$P,D$5,FALSE)","v":0.26},{"$f":"VLOOKUP($A$7&$A$4&\"Totals\",Data!$A:$P,E$5,FALSE)","v":0.3},{"$f":"VLOOKUP($A$7&$A$4&\"Totals\",Data!$A:$P,F$5,FALSE)","v":0.13},{"$f":"VLOOKUP($A$7&$A$4&\"Totals\",Data!$A:$P,G$5,FALSE)","v":0.08},{"$f":"VLOOKUP($A$7&$A$4&\"Totals\",Data!$A:$P,H$5,FALSE)","v":0.22},{"$f":"VLOOKUP($A$7&$A$4&\"Totals\",Data!$A:$P,I$5,FALSE)","v":1},null,{"$f":"IF($P$13=\"NR\",\"NR\",(VLOOKUP($A$7&$A$4&\"Totals\",Data!$A:$P,K$5,FALSE)))","v":0.13},{"$f":"IF($P$13=\"NR\",\"NR\",(VLOOKUP($A$7&$A$4&\"Totals\",Data!$A:$P,L$5,FALSE)))","v":0.62},{"$f":"IF($P$13=\"NR\",\"NR\",(VLOOKUP($A$7&$A$4&\"Totals\",Data!$A:$P,M$5,FALSE)))","v":0.11},{"$f":"IF($P$13=\"NR\",\"NR\",(VLOOKUP($A$7&$A$4&\"Totals\",Data!$A:$P,N$5,FALSE)))","v":0.05},{"$f":"IF($P$13=\"NR\",\"NR\",(VLOOKUP($A$7&$A$4&\"Totals\",Data!$A:$P,O$5,FALSE)))","v":0.09},{"$f":"IF(VLOOKUP($A$7&$A$4&\"Totals\",Data!$A:$P,P$5,FALSE)=0,\"NR\",VLOOKUP($A$7&$A$4&\"Totals\",Data!$A:$P,P$5,FALSE))","v":1}]
[null,null,"Source: Scottish Government Quarterly Monitoring Return"]
[null,null,"Percentages have been rounded to the nearest percentage point."]
{"$rows_left_out":2}
{"sheet":"LKPS","index":4,"n_rows":35,"n_cols":8,"rows_kept":35,"cut":false,"hidden":true,"merged":[]}
[]
[]
[null,"January to March 2012","January to March2012","JantoMar12",null,"Critical",null,"Aberdeen City"]
[null,"January to March 2013","January to March2013","JantoMar13",null,"Substantial",null,"Aberdeenshire"]
[null,"January to March 2014","January to March2014","JantoMar14",null,"Moderate",null,"Angus"]
[null,"January to March 2015","January to March2015","JantoMar15",null,"Low or No Risk",null,"Argyll & Bute"]
[null,"January to March 2016","January to March2016","JantoMar16",null,"Not available",null,"Clackmannanshire"]
[null,"January to March 2017","January to March2017","JantoMar17",null,"Totals",null,"Dumfries and Galloway"]
[null,"January to March 2018","January to March2018","JantoMar18",null,null,null,"Dundee City"]
[null,null,null,null,null,null,null,"East Ayrshire"]
[null,null,null,null,null,null,null,"East Dunbartonshire"]
[null,null,null,null,null,null,null,"East Lothian"]
[null,null,null,null,null,null,null,"East Renfrewshire"]
[null,null,null,null,null,null,null,"Edinburgh, City of"]
[null,null,null,null,null,null,null,"Eilean Siar"]
{"$rows_left_out":21}
{"sheet":"Data","index":5,"n_rows":3368,"n_cols":16,"rows_kept":3368,"cut":false,"hidden":true,"merged":[]}
[1,2,3,4,5,6,7,8,9,10,11,12,13,14,15,16]
[null,null,null,null,"Less than or equal to 2 days","More than 2 days and <= 2 weeks","More than 2 weeks and <= 4 weeks","More than 4 weeks and <= 6 weeks","More than 6 weeks","Total","Before care assessment completed","Less than or equal to 2 weeks","More than 2 weeks and <= 4 weeks","More than 4 weeks and <= 6 weeks","More than 6 weeks ","Total"]
[{"$f":"D3&B3&C3","v":"JantoMar11Aberdeen CityCritical"},"Aberdeen City","Critical","JantoMar11",0.63,0.31,0,0,0.06,1,0,0.67,0.13,7.0000000000000007E-2,0.13,1]
[{"$f":"D4&B4&C4","v":"JantoMar11Aberdeen CitySubstantial"},"Aberdeen City","Substantial","JantoMar11",0.19,0.31,0.38,0,0.13,1,0.08,0.67,0.08,0,0.17,1]
["JantoMar11Aberdeen CityModerate","Aberdeen City","Moderate","JantoMar11",0,0,0,0,0,0,0,0,0,0,0,0]
["JantoMar11Aberdeen CityLow or No Risk","Aberdeen City","Low or No Risk","JantoMar11",0,0,0,0,0,0,0,0,0,0,0,0]
["JantoMar11Aberdeen CityNot available","Aberdeen City","Not available","JantoMar11",0,0,0,0,0,0,0,0,0,0,0,0]
["JantoMar11Aberdeen CityTotals","Aberdeen City","Totals","JantoMar11",0.41,0.31,0.19,0,0.09,1,0.04,0.67,0.11,0.04,0.15,1]
["JantoMar11AberdeenshireCritical","Aberdeenshire","Critical","JantoMar11",0,0,0,0,0,0,0,0,0,0,0,0]
["JantoMar11AberdeenshireSubstantial","Aberdeenshire","Substantial","JantoMar11",0,0,0,0,0,0,0,0,0,0,0,0]
["JantoMar11AberdeenshireModerate","Aberdeenshire","Moderate","JantoMar11",0,0,0,0,0,0,0,0,0,0,0,0]
["JantoMar11AberdeenshireLow or No Risk","Aberdeenshire","Low or No Risk","JantoMar11",0,0,0,0,0,0,0,0,0,0,0,0]
["JantoMar11AberdeenshireNot available","Aberdeenshire","Not available","JantoMar11",0.1,0.46,0.22,0.05,0.17,1,0,0,0,0,0,0]
["JantoMar11AberdeenshireTotals","Aberdeenshire","Totals","JantoMar11",0.1,0.46,0.22,0.05,0.17,1,0,0,0,0,0,0]
["JantoMar11AngusCritical","Angus","Critical","JantoMar11",0.04,0.09,0.09,0.17,0.61,1,0.39,0.28000000000000003,0.11,0.17,0.06,1]
{"$rows_left_out":3353}